[Page version: 20260919 18:54:16]
Measurements for amd64, h2atom, crypto_core Test results for amd64, h2atom, crypto_core Test results for crypto_core/aes128encrypt| Time | Object size | Test size | Implementation | Compiler | Benchmark date | SUPERCOP version |
|---|---|---|---|---|---|---|
| 832 | 6179 0 0 | 29188 1240 1512 | T:dolbeau/std-4ft | clang -march=native -O2 -fwrapv -Qunused-arguments -fPIC -fPIE -gdwarf-4 -Wall | 20260503 | 20260330 |
| 856 | 7074 0 0 | 31276 1240 1512 | T:dolbeau/std-4ft | clang -march=native -O3 -fwrapv -Qunused-arguments -fPIC -fPIE -gdwarf-4 -Wall | 20260503 | 20260330 |
| 902 | 5102 0 0 | 29308 1240 1512 | T:dolbeau/std-2ft | clang -march=native -O3 -fwrapv -Qunused-arguments -fPIC -fPIE -gdwarf-4 -Wall | 20260503 | 20260330 |
| 913 | 4168 0 0 | 27172 1240 1512 | T:dolbeau/std-2ft | clang -march=native -O2 -fwrapv -Qunused-arguments -fPIC -fPIE -gdwarf-4 -Wall | 20260503 | 20260330 |
| 921 | 3137 0 0 | 26148 1240 1512 | T:dolbeau/std-1ft | clang -march=native -O2 -fwrapv -Qunused-arguments -fPIC -fPIE -gdwarf-4 -Wall | 20260503 | 20260330 |
| 933 | 4072 0 0 | 28268 1240 1512 | T:dolbeau/std-1ft | clang -march=native -O3 -fwrapv -Qunused-arguments -fPIC -fPIE -gdwarf-4 -Wall | 20260503 | 20260330 |
| 1009 | 6267 0 0 | 27406 1232 1512 | T:dolbeau/std-4ft | clang -march=native -Os -fwrapv -Qunused-arguments -fPIC -fPIE -gdwarf-4 -Wall | 20260503 | 20260330 |
| 1035 | 7042 0 0 | 31595 1224 1608 | T:dolbeau/std-4ft | gcc -march=native -mtune=native -O3 -fwrapv -fPIC -fPIE -gdwarf-4 -Wall | 20260503 | 20260330 |
| 1053 | 6179 0 0 | 27924 1240 1512 | T:dolbeau/std-4ft | clang -march=native -O -fwrapv -Qunused-arguments -fPIC -fPIE -gdwarf-4 -Wall | 20260503 | 20260330 |
| 1058 | 4166 0 0 | 25908 1240 1512 | T:dolbeau/std-2ft | clang -march=native -O -fwrapv -Qunused-arguments -fPIC -fPIE -gdwarf-4 -Wall | 20260503 | 20260330 |
| 1058 | 6386 0 0 | 29859 1224 1608 | T:dolbeau/std-4ft | gcc -march=native -mtune=native -O2 -fwrapv -fPIC -fPIE -gdwarf-4 -Wall | 20260503 | 20260330 |
| 1061 | 5043 0 0 | 29595 1224 1608 | T:dolbeau/std-2ft | gcc -march=native -mtune=native -O3 -fwrapv -fPIC -fPIE -gdwarf-4 -Wall | 20260503 | 20260330 |
| 1063 | 4323 0 0 | 27795 1224 1608 | T:dolbeau/std-2ft | gcc -march=native -mtune=native -O2 -fwrapv -fPIC -fPIE -gdwarf-4 -Wall | 20260503 | 20260330 |
| 1077 | 4233 0 0 | 25374 1232 1512 | T:dolbeau/std-2ft | clang -march=native -Os -fwrapv -Qunused-arguments -fPIC -fPIE -gdwarf-4 -Wall | 20260503 | 20260330 |
| 1080 | 3175 0 0 | 24318 1232 1512 | T:dolbeau/std-1ft | clang -march=native -Os -fwrapv -Qunused-arguments -fPIC -fPIE -gdwarf-4 -Wall | 20260503 | 20260330 |
| 1137 | 3140 0 0 | 24884 1240 1512 | T:dolbeau/std-1ft | clang -march=native -O -fwrapv -Qunused-arguments -fPIC -fPIE -gdwarf-4 -Wall | 20260503 | 20260330 |
| 1152 | 6291 0 0 | 27657 1200 1576 | T:dolbeau/std-4ft | gcc -march=native -mtune=native -Os -fwrapv -fPIC -fPIE -gdwarf-4 -Wall | 20260503 | 20260330 |
| 1180 | 6955 0 0 | 31180 1240 1512 | T:dolbeau/std-4ft | clang -mcpu=native -O3 -fwrapv -Qunused-arguments -fPIC -fPIE -gdwarf-4 -Wall | 20260503 | 20260330 |
| 1202 | 6343 0 0 | 29074 1216 1608 | T:dolbeau/std-4ft | gcc -march=native -mtune=native -O -fwrapv -fPIC -fPIE -gdwarf-4 -Wall | 20260503 | 20260330 |
| 1251 | 4021 0 0 | 28571 1224 1608 | T:dolbeau/std-1ft | gcc -march=native -mtune=native -O3 -fwrapv -fPIC -fPIE -gdwarf-4 -Wall | 20260503 | 20260330 |
| 1256 | 5019 0 0 | 29244 1240 1512 | T:dolbeau/std-2ft | clang -mcpu=native -O3 -fwrapv -Qunused-arguments -fPIC -fPIE -gdwarf-4 -Wall | 20260503 | 20260330 |
| 1272 | 3314 0 0 | 26787 1224 1608 | T:dolbeau/std-1ft | gcc -march=native -mtune=native -O2 -fwrapv -fPIC -fPIE -gdwarf-4 -Wall | 20260503 | 20260330 |
| 1286 | 4283 0 0 | 25657 1200 1576 | T:dolbeau/std-2ft | gcc -march=native -mtune=native -Os -fwrapv -fPIC -fPIE -gdwarf-4 -Wall | 20260503 | 20260330 |
| 1304 | 3926 0 0 | 28140 1240 1512 | T:dolbeau/std-1ft | clang -mcpu=native -O3 -fwrapv -Qunused-arguments -fPIC -fPIE -gdwarf-4 -Wall | 20260503 | 20260330 |
| 1318 | 3212 0 0 | 24585 1200 1576 | T:dolbeau/std-1ft | gcc -march=native -mtune=native -Os -fwrapv -fPIC -fPIE -gdwarf-4 -Wall | 20260503 | 20260330 |
| 1506 | 4313 0 0 | 27042 1216 1608 | T:dolbeau/std-2ft | gcc -march=native -mtune=native -O -fwrapv -fPIC -fPIE -gdwarf-4 -Wall | 20260503 | 20260330 |
| 1691 | 3337 0 0 | 26066 1216 1608 | T:dolbeau/std-1ft | gcc -march=native -mtune=native -O -fwrapv -fPIC -fPIE -gdwarf-4 -Wall | 20260503 | 20260330 |
| 558066 | 3709 0 0 | 27892 1240 1512 | ref | clang -march=native -O3 -fwrapv -Qunused-arguments -fPIC -fPIE -gdwarf-4 -Wall | 20260503 | 20260330 |
| 607366 | 5612 0 0 | 30171 1224 1608 | ref | gcc -march=native -mtune=native -O3 -fwrapv -fPIC -fPIE -gdwarf-4 -Wall | 20260503 | 20260330 |
| 619476 | 3634 0 0 | 27828 1240 1512 | ref | clang -mcpu=native -O3 -fwrapv -Qunused-arguments -fPIC -fPIE -gdwarf-4 -Wall | 20260503 | 20260330 |
| 948843 | 1516 0 0 | 22630 1232 1512 | ref | clang -march=native -Os -fwrapv -Qunused-arguments -fPIC -fPIE -gdwarf-4 -Wall | 20260503 | 20260330 |
| 1242779 | 2894 0 0 | 25876 1240 1512 | ref | clang -march=native -O2 -fwrapv -Qunused-arguments -fPIC -fPIE -gdwarf-4 -Wall | 20260503 | 20260330 |
| 1408104 | 2023 0 0 | 25483 1224 1608 | ref | gcc -march=native -mtune=native -O2 -fwrapv -fPIC -fPIE -gdwarf-4 -Wall | 20260503 | 20260330 |
| 1844842 | 1692 0 0 | 23420 1240 1512 | ref | clang -march=native -O -fwrapv -Qunused-arguments -fPIC -fPIE -gdwarf-4 -Wall | 20260503 | 20260330 |
| 2398473 | 1652 0 0 | 23049 1200 1576 | ref | gcc -march=native -mtune=native -Os -fwrapv -fPIC -fPIE -gdwarf-4 -Wall | 20260503 | 20260330 |
| 2536670 | 1980 0 0 | 24722 1216 1608 | ref | gcc -march=native -mtune=native -O -fwrapv -fPIC -fPIE -gdwarf-4 -Wall | 20260503 | 20260330 |
core.c: core.c:13:25: warning: unused variable 'temp2' [-Wunused-variable] core.c: 13 | __m128i temp0, temp1, temp2, temp4; core.c: | ^~~~~ core.c: core.c:29:3: error: '__builtin_ia32_aeskeygenassist128' needs target feature aes core.c: 29 | BLOCK1(0x01); core.c: | ^ core.c: core.c:20:11: note: expanded from macro 'BLOCK1' core.c: 20 | temp1 = _mm_aeskeygenassist_si128(temp0, IMM); \ core.c: | ^ core.c: /usr/lib/llvm-18/lib/clang/18/include/__wmmintrin_aes.h:136:13: note: expanded from macro '_mm_aeskeygenassist_si128' core.c: 136 | ((__m128i)__builtin_ia32_aeskeygenassist128((__v2di)(__m128i)(C), (int)(R))) core.c: | ^ core.c: core.c:30:3: error: '__builtin_ia32_aeskeygenassist128' needs target feature aes core.c: 30 | BLOCK1(0x02); core.c: | ^ core.c: core.c:20:11: note: expanded from macro 'BLOCK1' core.c: 20 | temp1 = _mm_aeskeygenassist_si128(temp0, IMM); \ core.c: | ^ core.c: /usr/lib/llvm-18/lib/clang/18/include/__wmmintrin_aes.h:136:13: note: expanded from macro '_mm_aeskeygenassist_si128' core.c: 136 | ((__m128i)__builtin_ia32_aeskeygenassist128((__v2di)(__m128i)(C), (int)(R))) core.c: | ^ core.c: core.c:31:3: error: '__builtin_ia32_aeskeygenassist128' needs target feature aes core.c: 31 | BLOCK1(0x04); core.c: | ^ core.c: core.c:20:11: note: expanded from macro 'BLOCK1' core.c: ...
| Implementation | Compiler |
| dolbeau/aesenc-int | clang -march=native -O2 -fwrapv -Qunused-arguments -fPIC -fPIE -gdwarf-4 -Wall (Ubuntu_Clang_18.1.3_(1ubuntu1)) |
| dolbeau/aesenc-int | clang -march=native -O3 -fwrapv -Qunused-arguments -fPIC -fPIE -gdwarf-4 -Wall (Ubuntu_Clang_18.1.3_(1ubuntu1)) |
| dolbeau/aesenc-int | clang -march=native -O -fwrapv -Qunused-arguments -fPIC -fPIE -gdwarf-4 -Wall (Ubuntu_Clang_18.1.3_(1ubuntu1)) |
| dolbeau/aesenc-int | clang -march=native -Os -fwrapv -Qunused-arguments -fPIC -fPIE -gdwarf-4 -Wall (Ubuntu_Clang_18.1.3_(1ubuntu1)) |
| dolbeau/aesenc-int | clang -mcpu=native -O3 -fwrapv -Qunused-arguments -fPIC -fPIE -gdwarf-4 -Wall (Ubuntu_Clang_18.1.3_(1ubuntu1)) |
core.c: core.c: In function 'aes128ni_setkey_encrypt': core.c: core.c:13:25: warning: unused variable 'temp2' [-Wunused-variable] core.c: 13 | __m128i temp0, temp1, temp2, temp4; core.c: | ^~~~~ core.c: core.c: In function 'aes128ni_encrypt': core.c: core.c:46: warning: ignoring '#pragma unroll ' [-Wunknown-pragmas] core.c: 46 | #pragma unroll(9) core.c: | core.c: In file included from /usr/lib/gcc/x86_64-linux-gnu/13/include/immintrin.h:41, core.c: from core.c:9: core.c: /usr/lib/gcc/x86_64-linux-gnu/13/include/wmmintrin.h: In function 'aes128ni_setkey_encrypt': core.c: /usr/lib/gcc/x86_64-linux-gnu/13/include/wmmintrin.h:87:1: error: inlining failed in call to 'always_inline' '_mm_aeskeygenassist_si128': target specific option mismatch core.c: 87 | _mm_aeskeygenassist_si128 (__m128i __X, const int __C) core.c: | ^~~~~~~~~~~~~~~~~~~~~~~~~ core.c: core.c:20:11: note: called from here core.c: 20 | temp1 = _mm_aeskeygenassist_si128(temp0, IMM); \ core.c: | ^~~~~~~~~~~~~~~~~~~~~~~~~~~~~~~~~~~~~ core.c: core.c:38:3: note: in expansion of macro 'BLOCK1' core.c: 38 | BLOCK1(0x36); core.c: | ^~~~~~ core.c: /usr/lib/gcc/x86_64-linux-gnu/13/include/wmmintrin.h:87:1: error: inlining failed in call to 'always_inline' '_mm_aeskeygenassist_si128': target specific option mismatch core.c: 87 | _mm_aeskeygenassist_si128 (__m128i __X, const int __C) core.c: | ^~~~~~~~~~~~~~~~~~~~~~~~~ core.c: core.c:20:11: note: called from here core.c: 20 | temp1 = _mm_aeskeygenassist_si128(temp0, IMM); \ core.c: ...
| Implementation | Compiler |
| dolbeau/aesenc-int | gcc -march=native -mtune=native -O2 -fwrapv -fPIC -fPIE -gdwarf-4 -Wall (13.3.0) |
| dolbeau/aesenc-int | gcc -march=native -mtune=native -O3 -fwrapv -fPIC -fPIE -gdwarf-4 -Wall (13.3.0) |
| dolbeau/aesenc-int | gcc -march=native -mtune=native -O -fwrapv -fPIC -fPIE -gdwarf-4 -Wall (13.3.0) |
| dolbeau/aesenc-int | gcc -march=native -mtune=native -Os -fwrapv -fPIC -fPIE -gdwarf-4 -Wall (13.3.0) |
core.c: In file included from core.c:9:
core.c: stdaes-common.h:548:21: warning: 'KT3' defined but not used [-Wunused-variable]
core.c: 548 | static unsigned int KT3[256] = KT0Data;
core.c: | ^~~
core.c: stdaes-common.h:541:21: warning: 'KT2' defined but not used [-Wunused-variable]
core.c: 541 | static unsigned int KT2[256] = KT0Data;
core.c: | ^~~
core.c: stdaes-common.h:534:21: warning: 'KT1' defined but not used [-Wunused-variable]
core.c: 534 | static unsigned int KT1[256] = KT0Data;
core.c: | ^~~
core.c: stdaes-common.h:527:21: warning: 'KT0' defined but not used [-Wunused-variable]
core.c: 527 | static unsigned int KT0[256] = KT0Data;
core.c: | ^~~
core.c: stdaes-common.h:450:21: warning: 'RT3' defined but not used [-Wunused-variable]
core.c: 450 | static unsigned int RT3[256] = { RT };
core.c: | ^~~
core.c: stdaes-common.h:443:21: warning: 'RT2' defined but not used [-Wunused-variable]
core.c: 443 | static unsigned int RT2[256] = { RT };
core.c: | ^~~
core.c: stdaes-common.h:436:21: warning: 'RT1' defined but not used [-Wunused-variable]
core.c: 436 | static unsigned int RT1[256] = { RT };
core.c: | ^~~
core.c: stdaes-common.h:429:21: warning: 'RT0' defined but not used [-Wunused-variable]
core.c: 429 | static unsigned int RT0[256] = { RT };
core.c: | ^~~
core.c: ...| Implementation | Compiler |
| T:dolbeau/std-1ft | gcc -march=native -mtune=native -O2 -fwrapv -fPIC -fPIE -gdwarf-4 -Wall (13.3.0) |
| T:dolbeau/std-1ft | gcc -march=native -mtune=native -O3 -fwrapv -fPIC -fPIE -gdwarf-4 -Wall (13.3.0) |
| T:dolbeau/std-1ft | gcc -march=native -mtune=native -O -fwrapv -fPIC -fPIE -gdwarf-4 -Wall (13.3.0) |
| T:dolbeau/std-1ft | gcc -march=native -mtune=native -Os -fwrapv -fPIC -fPIE -gdwarf-4 -Wall (13.3.0) |
| T:dolbeau/std-2ft | gcc -march=native -mtune=native -O2 -fwrapv -fPIC -fPIE -gdwarf-4 -Wall (13.3.0) |
| T:dolbeau/std-2ft | gcc -march=native -mtune=native -O3 -fwrapv -fPIC -fPIE -gdwarf-4 -Wall (13.3.0) |
| T:dolbeau/std-2ft | gcc -march=native -mtune=native -O -fwrapv -fPIC -fPIE -gdwarf-4 -Wall (13.3.0) |
| T:dolbeau/std-2ft | gcc -march=native -mtune=native -Os -fwrapv -fPIC -fPIE -gdwarf-4 -Wall (13.3.0) |
| T:dolbeau/std-4ft | gcc -march=native -mtune=native -O2 -fwrapv -fPIC -fPIE -gdwarf-4 -Wall (13.3.0) |
| T:dolbeau/std-4ft | gcc -march=native -mtune=native -O3 -fwrapv -fPIC -fPIE -gdwarf-4 -Wall (13.3.0) |
| T:dolbeau/std-4ft | gcc -march=native -mtune=native -O -fwrapv -fPIC -fPIE -gdwarf-4 -Wall (13.3.0) |
| T:dolbeau/std-4ft | gcc -march=native -mtune=native -Os -fwrapv -fPIC -fPIE -gdwarf-4 -Wall (13.3.0) |
core.c: core.c:1:10: fatal error: 'openssl/aes.h' file not found core.c: 1 | #include <openssl/aes.h> core.c: | ^~~~~~~~~~~~~~~ core.c: 1 error generated.
| Implementation | Compiler |
| T:openssl | clang -march=native -O2 -fwrapv -Qunused-arguments -fPIC -fPIE -gdwarf-4 -Wall (Ubuntu_Clang_18.1.3_(1ubuntu1)) |
| T:openssl | clang -march=native -O3 -fwrapv -Qunused-arguments -fPIC -fPIE -gdwarf-4 -Wall (Ubuntu_Clang_18.1.3_(1ubuntu1)) |
| T:openssl | clang -march=native -O -fwrapv -Qunused-arguments -fPIC -fPIE -gdwarf-4 -Wall (Ubuntu_Clang_18.1.3_(1ubuntu1)) |
| T:openssl | clang -march=native -Os -fwrapv -Qunused-arguments -fPIC -fPIE -gdwarf-4 -Wall (Ubuntu_Clang_18.1.3_(1ubuntu1)) |
| T:openssl | clang -mcpu=native -O3 -fwrapv -Qunused-arguments -fPIC -fPIE -gdwarf-4 -Wall (Ubuntu_Clang_18.1.3_(1ubuntu1)) |
core.c: core.c:1:10: fatal error: openssl/aes.h: No such file or directory core.c: 1 | #include <openssl/aes.h> core.c: | ^~~~~~~~~~~~~~~ core.c: compilation terminated.
| Implementation | Compiler |
| T:openssl | gcc -march=native -mtune=native -O2 -fwrapv -fPIC -fPIE -gdwarf-4 -Wall (13.3.0) |
| T:openssl | gcc -march=native -mtune=native -O3 -fwrapv -fPIC -fPIE -gdwarf-4 -Wall (13.3.0) |
| T:openssl | gcc -march=native -mtune=native -O -fwrapv -fPIC -fPIE -gdwarf-4 -Wall (13.3.0) |
| T:openssl | gcc -march=native -mtune=native -Os -fwrapv -fPIC -fPIE -gdwarf-4 -Wall (13.3.0) |
TIMECOP iterations: 1
| Implementation | Compiler |
| ref | clang -march=native -O2 -fwrapv -Qunused-arguments -fPIC -fPIE -gdwarf-4 -Wall (Ubuntu_Clang_18.1.3_(1ubuntu1)) |
| ref | clang -march=native -O3 -fwrapv -Qunused-arguments -fPIC -fPIE -gdwarf-4 -Wall (Ubuntu_Clang_18.1.3_(1ubuntu1)) |
| ref | clang -march=native -O -fwrapv -Qunused-arguments -fPIC -fPIE -gdwarf-4 -Wall (Ubuntu_Clang_18.1.3_(1ubuntu1)) |
| ref | clang -march=native -Os -fwrapv -Qunused-arguments -fPIC -fPIE -gdwarf-4 -Wall (Ubuntu_Clang_18.1.3_(1ubuntu1)) |
| ref | clang -mcpu=native -O3 -fwrapv -Qunused-arguments -fPIC -fPIE -gdwarf-4 -Wall (Ubuntu_Clang_18.1.3_(1ubuntu1)) |
| ref | gcc -march=native -mtune=native -O2 -fwrapv -fPIC -fPIE -gdwarf-4 -Wall (13.3.0) |
| ref | gcc -march=native -mtune=native -O3 -fwrapv -fPIC -fPIE -gdwarf-4 -Wall (13.3.0) |
| ref | gcc -march=native -mtune=native -O -fwrapv -fPIC -fPIE -gdwarf-4 -Wall (13.3.0) |
| ref | gcc -march=native -mtune=native -Os -fwrapv -fPIC -fPIE -gdwarf-4 -Wall (13.3.0) |