Test results for amd64, h2atom, crypto_core/aes128decrypt

[Page version: 20260919 18:54:16]

Measurements for amd64, h2atom, crypto_core Test results for amd64, h2atom, crypto_core Test results for crypto_core/aes128decrypt
Computer: h2atom
Microarchitecture: amd64; Bonnell (106ca)
Architecture: amd64
CPU ID: GenuineIntel-000106ca-bfe9fbff
SUPERCOP version: 20260330
Operation: crypto_core
Primitive: aes128decrypt
TimeObject sizeTest sizeImplementationCompilerBenchmark dateSUPERCOP version
145311590 0 034596 1240 1512T:dolbeau/std-4rt-nodkclang -march=native -O2 -fwrapv -Qunused-arguments -fPIC -fPIE -gdwarf-4 -Wall2026050320260330
150312265 0 036476 1240 1512T:dolbeau/std-4rt-nodkclang -march=native -O3 -fwrapv -Qunused-arguments -fPIC -fPIE -gdwarf-4 -Wall2026050320260330
15646189 0 030747 1224 1608T:dolbeau/std-1rt-nodkgcc -march=native -mtune=native -O3 -fwrapv -fPIC -fPIE -gdwarf-4 -Wall2026050320260330
15697542 0 031011 1224 1608T:dolbeau/std-2rt-nodkgcc -march=native -mtune=native -O2 -fwrapv -fPIC -fPIE -gdwarf-4 -Wall2026050320260330
15828291 0 032843 1224 1608T:dolbeau/std-2rt-nodkgcc -march=native -mtune=native -O3 -fwrapv -fPIC -fPIE -gdwarf-4 -Wall2026050320260330
15995531 0 026670 1232 1512T:dolbeau/std-1rt-nodkclang -march=native -Os -fwrapv -Qunused-arguments -fPIC -fPIE -gdwarf-4 -Wall2026050320260330
161111587 0 033332 1240 1512T:dolbeau/std-4rt-nodkclang -march=native -O -fwrapv -Qunused-arguments -fPIC -fPIE -gdwarf-4 -Wall2026050320260330
16155449 0 026825 1200 1576T:dolbeau/std-1rt-nodkgcc -march=native -mtune=native -Os -fwrapv -fPIC -fPIE -gdwarf-4 -Wall2026050320260330
16335474 0 028947 1224 1608T:dolbeau/std-1rt-nodkgcc -march=native -mtune=native -O2 -fwrapv -fPIC -fPIE -gdwarf-4 -Wall2026050320260330
16377539 0 028905 1200 1576T:dolbeau/std-2rt-nodkgcc -march=native -mtune=native -Os -fwrapv -fPIC -fPIE -gdwarf-4 -Wall2026050320260330
16436181 0 030380 1240 1512T:dolbeau/std-1rt-nodkclang -march=native -O3 -fwrapv -Qunused-arguments -fPIC -fPIE -gdwarf-4 -Wall2026050320260330
165712448 0 037003 1224 1608T:dolbeau/std-4rt-nodkgcc -march=native -mtune=native -O3 -fwrapv -fPIC -fPIE -gdwarf-4 -Wall2026050320260330
16715492 0 028500 1240 1512T:dolbeau/std-1rt-nodkclang -march=native -O2 -fwrapv -Qunused-arguments -fPIC -fPIE -gdwarf-4 -Wall2026050320260330
17097621 0 028766 1232 1512T:dolbeau/std-2rt-nodkclang -march=native -Os -fwrapv -Qunused-arguments -fPIC -fPIE -gdwarf-4 -Wall2026050320260330
171611705 0 035187 1224 1608T:dolbeau/std-4rt-nodkgcc -march=native -mtune=native -O2 -fwrapv -fPIC -fPIE -gdwarf-4 -Wall2026050320260330
17398388 0 032588 1240 1512T:dolbeau/std-2rt-nodkclang -march=native -O3 -fwrapv -Qunused-arguments -fPIC -fPIE -gdwarf-4 -Wall2026050320260330
176911628 0 033001 1200 1576T:dolbeau/std-4rt-nodkgcc -march=native -mtune=native -Os -fwrapv -fPIC -fPIE -gdwarf-4 -Wall2026050320260330
179311723 0 032862 1232 1512T:dolbeau/std-4rt-nodkclang -march=native -Os -fwrapv -Qunused-arguments -fPIC -fPIE -gdwarf-4 -Wall2026050320260330
18055490 0 027236 1240 1512T:dolbeau/std-1rt-nodkclang -march=native -O -fwrapv -Qunused-arguments -fPIC -fPIE -gdwarf-4 -Wall2026050320260330
182011747 0 034482 1216 1608T:dolbeau/std-4rt-nodkgcc -march=native -mtune=native -O -fwrapv -fPIC -fPIE -gdwarf-4 -Wall2026050320260330
18227622 0 030628 1240 1512T:dolbeau/std-2rt-nodkclang -march=native -O2 -fwrapv -Qunused-arguments -fPIC -fPIE -gdwarf-4 -Wall2026050320260330
18857595 0 030338 1216 1608T:dolbeau/std-2rt-nodkgcc -march=native -mtune=native -O -fwrapv -fPIC -fPIE -gdwarf-4 -Wall2026050320260330
19075552 0 028290 1216 1608T:dolbeau/std-1rt-nodkgcc -march=native -mtune=native -O -fwrapv -fPIC -fPIE -gdwarf-4 -Wall2026050320260330
192212237 0 036460 1240 1512T:dolbeau/std-4rt-nodkclang -mcpu=native -O3 -fwrapv -Qunused-arguments -fPIC -fPIE -gdwarf-4 -Wall2026050320260330
20177622 0 029364 1240 1512T:dolbeau/std-2rt-nodkclang -march=native -O -fwrapv -Qunused-arguments -fPIC -fPIE -gdwarf-4 -Wall2026050320260330
21116167 0 030380 1240 1512T:dolbeau/std-1rt-nodkclang -mcpu=native -O3 -fwrapv -Qunused-arguments -fPIC -fPIE -gdwarf-4 -Wall2026050320260330
21508285 0 032508 1240 1512T:dolbeau/std-2rt-nodkclang -mcpu=native -O3 -fwrapv -Qunused-arguments -fPIC -fPIE -gdwarf-4 -Wall2026050320260330
6564704557 0 028732 1240 1512refclang -march=native -O3 -fwrapv -Qunused-arguments -fPIC -fPIE -gdwarf-4 -Wall2026050320260330
71214810811 0 035387 1224 1608refgcc -march=native -mtune=native -O3 -fwrapv -fPIC -fPIE -gdwarf-4 -Wall2026050320260330
7284064626 0 028812 1240 1512refclang -mcpu=native -O3 -fwrapv -Qunused-arguments -fPIC -fPIE -gdwarf-4 -Wall2026050320260330
12184732634 0 026115 1224 1608refgcc -march=native -mtune=native -O2 -fwrapv -fPIC -fPIE -gdwarf-4 -Wall2026050320260330
14485772721 0 025708 1240 1512refclang -march=native -O2 -fwrapv -Qunused-arguments -fPIC -fPIE -gdwarf-4 -Wall2026050320260330
15158661945 0 023054 1232 1512refclang -march=native -Os -fwrapv -Qunused-arguments -fPIC -fPIE -gdwarf-4 -Wall2026050320260330
21345822233 0 023956 1240 1512refclang -march=native -O -fwrapv -Qunused-arguments -fPIC -fPIE -gdwarf-4 -Wall2026050320260330
28154172131 0 023529 1200 1576refgcc -march=native -mtune=native -Os -fwrapv -fPIC -fPIE -gdwarf-4 -Wall2026050320260330
29827282625 0 025362 1216 1608refgcc -march=native -mtune=native -O -fwrapv -fPIC -fPIE -gdwarf-4 -Wall2026050320260330

Compiler output


core.c: core.c:49:16: error: always_inline function '_mm_aesimc_si128' requires target feature 'aes', but would be inlined into function 'aes128ni_setkey_decrypt' that is compiled without support for 'aes'
core.c:    49 |     rkeys[i] = _mm_aesimc_si128(tkeys[10-i]);
core.c:       |                ^
core.c: core.c:29:3: error: '__builtin_ia32_aeskeygenassist128' needs target feature aes
core.c:    29 |   BLOCK1(0x01);
core.c:       |   ^
core.c: core.c:20:11: note: expanded from macro 'BLOCK1'
core.c:    20 |   temp1 = _mm_aeskeygenassist_si128(temp0, IMM);        \
core.c:       |           ^
core.c: /usr/lib/llvm-18/lib/clang/18/include/__wmmintrin_aes.h:136:13: note: expanded from macro '_mm_aeskeygenassist_si128'
core.c:   136 |   ((__m128i)__builtin_ia32_aeskeygenassist128((__v2di)(__m128i)(C), (int)(R)))
core.c:       |             ^
core.c: core.c:30:3: error: '__builtin_ia32_aeskeygenassist128' needs target feature aes
core.c:    30 |   BLOCK1(0x02);
core.c:       |   ^
core.c: core.c:20:11: note: expanded from macro 'BLOCK1'
core.c:    20 |   temp1 = _mm_aeskeygenassist_si128(temp0, IMM);        \
core.c:       |           ^
core.c: /usr/lib/llvm-18/lib/clang/18/include/__wmmintrin_aes.h:136:13: note: expanded from macro '_mm_aeskeygenassist_si128'
core.c:   136 |   ((__m128i)__builtin_ia32_aeskeygenassist128((__v2di)(__m128i)(C), (int)(R)))
core.c:       |             ^
core.c: core.c:31:3: error: '__builtin_ia32_aeskeygenassist128' needs target feature aes
core.c:    31 |   BLOCK1(0x04);
core.c:       |   ^
core.c: core.c:20:11: note: expanded from macro 'BLOCK1'
core.c: ...

Number of similar (implementation,compiler) pairs: 5, namely:
ImplementationCompiler
dolbeau/aesenc-intclang -march=native -O2 -fwrapv -Qunused-arguments -fPIC -fPIE -gdwarf-4 -Wall (Ubuntu_Clang_18.1.3_(1ubuntu1))
dolbeau/aesenc-intclang -march=native -O3 -fwrapv -Qunused-arguments -fPIC -fPIE -gdwarf-4 -Wall (Ubuntu_Clang_18.1.3_(1ubuntu1))
dolbeau/aesenc-intclang -march=native -O -fwrapv -Qunused-arguments -fPIC -fPIE -gdwarf-4 -Wall (Ubuntu_Clang_18.1.3_(1ubuntu1))
dolbeau/aesenc-intclang -march=native -Os -fwrapv -Qunused-arguments -fPIC -fPIE -gdwarf-4 -Wall (Ubuntu_Clang_18.1.3_(1ubuntu1))
dolbeau/aesenc-intclang -mcpu=native -O3 -fwrapv -Qunused-arguments -fPIC -fPIE -gdwarf-4 -Wall (Ubuntu_Clang_18.1.3_(1ubuntu1))

Compiler output


core.c: core.c: In function 'aes128ni_setkey_decrypt':
core.c: core.c:47: warning: ignoring '#pragma unroll ' [-Wunknown-pragmas]
core.c:    47 | #pragma unroll(9)
core.c:       |
core.c: core.c: In function 'aes128ni_decrypt':
core.c: core.c:57: warning: ignoring '#pragma unroll ' [-Wunknown-pragmas]
core.c:    57 | #pragma unroll(9)
core.c:       |
core.c: In file included from /usr/lib/gcc/x86_64-linux-gnu/13/include/immintrin.h:41,
core.c:                  from core.c:9:
core.c: /usr/lib/gcc/x86_64-linux-gnu/13/include/wmmintrin.h: In function 'aes128ni_setkey_encrypt':
core.c: /usr/lib/gcc/x86_64-linux-gnu/13/include/wmmintrin.h:87:1: error: inlining failed in call to 'always_inline' '_mm_aeskeygenassist_si128': target specific option mismatch
core.c:    87 | _mm_aeskeygenassist_si128 (__m128i __X, const int __C)
core.c:       | ^~~~~~~~~~~~~~~~~~~~~~~~~
core.c: core.c:20:11: note: called from here
core.c:    20 |   temp1 = _mm_aeskeygenassist_si128(temp0, IMM);        \
core.c:       |           ^~~~~~~~~~~~~~~~~~~~~~~~~~~~~~~~~~~~~
core.c: core.c:38:3: note: in expansion of macro 'BLOCK1'
core.c:    38 |   BLOCK1(0x36);
core.c:       |   ^~~~~~
core.c: /usr/lib/gcc/x86_64-linux-gnu/13/include/wmmintrin.h:87:1: error: inlining failed in call to 'always_inline' '_mm_aeskeygenassist_si128': target specific option mismatch
core.c:    87 | _mm_aeskeygenassist_si128 (__m128i __X, const int __C)
core.c:       | ^~~~~~~~~~~~~~~~~~~~~~~~~
core.c: core.c:20:11: note: called from here
core.c:    20 |   temp1 = _mm_aeskeygenassist_si128(temp0, IMM);        \
core.c: ...

Number of similar (implementation,compiler) pairs: 4, namely:
ImplementationCompiler
dolbeau/aesenc-intgcc -march=native -mtune=native -O2 -fwrapv -fPIC -fPIE -gdwarf-4 -Wall (13.3.0)
dolbeau/aesenc-intgcc -march=native -mtune=native -O3 -fwrapv -fPIC -fPIE -gdwarf-4 -Wall (13.3.0)
dolbeau/aesenc-intgcc -march=native -mtune=native -O -fwrapv -fPIC -fPIE -gdwarf-4 -Wall (13.3.0)
dolbeau/aesenc-intgcc -march=native -mtune=native -Os -fwrapv -fPIC -fPIE -gdwarf-4 -Wall (13.3.0)

Compiler output


core.c: In file included from core.c:9:
core.c: stdaes-common.h:548:21: warning: 'KT3' defined but not used [-Wunused-variable]
core.c:   548 | static unsigned int KT3[256] = KT0Data;
core.c:       |                     ^~~
core.c: stdaes-common.h:541:21: warning: 'KT2' defined but not used [-Wunused-variable]
core.c:   541 | static unsigned int KT2[256] = KT0Data;
core.c:       |                     ^~~
core.c: stdaes-common.h:534:21: warning: 'KT1' defined but not used [-Wunused-variable]
core.c:   534 | static unsigned int KT1[256] = KT0Data;
core.c:       |                     ^~~
core.c: stdaes-common.h:450:21: warning: 'RT3' defined but not used [-Wunused-variable]
core.c:   450 | static unsigned int RT3[256] = { RT };
core.c:       |                     ^~~
core.c: stdaes-common.h:443:21: warning: 'RT2' defined but not used [-Wunused-variable]
core.c:   443 | static unsigned int RT2[256] = { RT };
core.c:       |                     ^~~
core.c: stdaes-common.h:436:21: warning: 'RT1' defined but not used [-Wunused-variable]
core.c:   436 | static unsigned int RT1[256] = { RT };
core.c:       |                     ^~~
core.c: stdaes-common.h:108:21: warning: 'FT3' defined but not used [-Wunused-variable]
core.c:   108 | static unsigned int FT3[256] = { FT };
core.c:       |                     ^~~
core.c: stdaes-common.h:100:21: warning: 'FT2' defined but not used [-Wunused-variable]
core.c:   100 | static unsigned int FT2[256] = { FT };
core.c:       |                     ^~~
core.c: ...

Number of similar (implementation,compiler) pairs: 4, namely:
ImplementationCompiler
T:dolbeau/std-1rt-nodkgcc -march=native -mtune=native -O2 -fwrapv -fPIC -fPIE -gdwarf-4 -Wall (13.3.0)
T:dolbeau/std-1rt-nodkgcc -march=native -mtune=native -O3 -fwrapv -fPIC -fPIE -gdwarf-4 -Wall (13.3.0)
T:dolbeau/std-1rt-nodkgcc -march=native -mtune=native -O -fwrapv -fPIC -fPIE -gdwarf-4 -Wall (13.3.0)
T:dolbeau/std-1rt-nodkgcc -march=native -mtune=native -Os -fwrapv -fPIC -fPIE -gdwarf-4 -Wall (13.3.0)

Compiler output


core.c: In file included from core.c:9:
core.c: stdaes-common.h:548:21: warning: 'KT3' defined but not used [-Wunused-variable]
core.c:   548 | static unsigned int KT3[256] = KT0Data;
core.c:       |                     ^~~
core.c: stdaes-common.h:541:21: warning: 'KT2' defined but not used [-Wunused-variable]
core.c:   541 | static unsigned int KT2[256] = KT0Data;
core.c:       |                     ^~~
core.c: stdaes-common.h:450:21: warning: 'RT3' defined but not used [-Wunused-variable]
core.c:   450 | static unsigned int RT3[256] = { RT };
core.c:       |                     ^~~
core.c: stdaes-common.h:443:21: warning: 'RT2' defined but not used [-Wunused-variable]
core.c:   443 | static unsigned int RT2[256] = { RT };
core.c:       |                     ^~~
core.c: stdaes-common.h:108:21: warning: 'FT3' defined but not used [-Wunused-variable]
core.c:   108 | static unsigned int FT3[256] = { FT };
core.c:       |                     ^~~
core.c: stdaes-common.h:100:21: warning: 'FT2' defined but not used [-Wunused-variable]
core.c:   100 | static unsigned int FT2[256] = { FT };
core.c:       |                     ^~~
core.c: stdaes-common.h:92:21: warning: 'FT1' defined but not used [-Wunused-variable]
core.c:    92 | static unsigned int FT1[256] = { FT };
core.c:       |                     ^~~
core.c: stdaes-common.h:84:21: warning: 'FT0' defined but not used [-Wunused-variable]
core.c:    84 | static unsigned int FT0[256] = { FT };
core.c:       |                     ^~~

Number of similar (implementation,compiler) pairs: 4, namely:
ImplementationCompiler
T:dolbeau/std-2rt-nodkgcc -march=native -mtune=native -O2 -fwrapv -fPIC -fPIE -gdwarf-4 -Wall (13.3.0)
T:dolbeau/std-2rt-nodkgcc -march=native -mtune=native -O3 -fwrapv -fPIC -fPIE -gdwarf-4 -Wall (13.3.0)
T:dolbeau/std-2rt-nodkgcc -march=native -mtune=native -O -fwrapv -fPIC -fPIE -gdwarf-4 -Wall (13.3.0)
T:dolbeau/std-2rt-nodkgcc -march=native -mtune=native -Os -fwrapv -fPIC -fPIE -gdwarf-4 -Wall (13.3.0)

Compiler output


core.c: In file included from core.c:9:
core.c: stdaes-common.h:108:21: warning: 'FT3' defined but not used [-Wunused-variable]
core.c:   108 | static unsigned int FT3[256] = { FT };
core.c:       |                     ^~~
core.c: stdaes-common.h:100:21: warning: 'FT2' defined but not used [-Wunused-variable]
core.c:   100 | static unsigned int FT2[256] = { FT };
core.c:       |                     ^~~
core.c: stdaes-common.h:92:21: warning: 'FT1' defined but not used [-Wunused-variable]
core.c:    92 | static unsigned int FT1[256] = { FT };
core.c:       |                     ^~~
core.c: stdaes-common.h:84:21: warning: 'FT0' defined but not used [-Wunused-variable]
core.c:    84 | static unsigned int FT0[256] = { FT };
core.c:       |                     ^~~

Number of similar (implementation,compiler) pairs: 4, namely:
ImplementationCompiler
T:dolbeau/std-4rt-nodkgcc -march=native -mtune=native -O2 -fwrapv -fPIC -fPIE -gdwarf-4 -Wall (13.3.0)
T:dolbeau/std-4rt-nodkgcc -march=native -mtune=native -O3 -fwrapv -fPIC -fPIE -gdwarf-4 -Wall (13.3.0)
T:dolbeau/std-4rt-nodkgcc -march=native -mtune=native -O -fwrapv -fPIC -fPIE -gdwarf-4 -Wall (13.3.0)
T:dolbeau/std-4rt-nodkgcc -march=native -mtune=native -Os -fwrapv -fPIC -fPIE -gdwarf-4 -Wall (13.3.0)

Compiler output


core.c: core.c:1:10: fatal error: 'openssl/aes.h' file not found
core.c:     1 | #include <openssl/aes.h>
core.c:       |          ^~~~~~~~~~~~~~~
core.c: 1 error generated.

Number of similar (implementation,compiler) pairs: 5, namely:
ImplementationCompiler
T:opensslclang -march=native -O2 -fwrapv -Qunused-arguments -fPIC -fPIE -gdwarf-4 -Wall (Ubuntu_Clang_18.1.3_(1ubuntu1))
T:opensslclang -march=native -O3 -fwrapv -Qunused-arguments -fPIC -fPIE -gdwarf-4 -Wall (Ubuntu_Clang_18.1.3_(1ubuntu1))
T:opensslclang -march=native -O -fwrapv -Qunused-arguments -fPIC -fPIE -gdwarf-4 -Wall (Ubuntu_Clang_18.1.3_(1ubuntu1))
T:opensslclang -march=native -Os -fwrapv -Qunused-arguments -fPIC -fPIE -gdwarf-4 -Wall (Ubuntu_Clang_18.1.3_(1ubuntu1))
T:opensslclang -mcpu=native -O3 -fwrapv -Qunused-arguments -fPIC -fPIE -gdwarf-4 -Wall (Ubuntu_Clang_18.1.3_(1ubuntu1))

Compiler output


core.c: core.c:1:10: fatal error: openssl/aes.h: No such file or directory
core.c:     1 | #include <openssl/aes.h>
core.c:       |          ^~~~~~~~~~~~~~~
core.c: compilation terminated.

Number of similar (implementation,compiler) pairs: 4, namely:
ImplementationCompiler
T:opensslgcc -march=native -mtune=native -O2 -fwrapv -fPIC -fPIE -gdwarf-4 -Wall (13.3.0)
T:opensslgcc -march=native -mtune=native -O3 -fwrapv -fPIC -fPIE -gdwarf-4 -Wall (13.3.0)
T:opensslgcc -march=native -mtune=native -O -fwrapv -fPIC -fPIE -gdwarf-4 -Wall (13.3.0)
T:opensslgcc -march=native -mtune=native -Os -fwrapv -fPIC -fPIE -gdwarf-4 -Wall (13.3.0)

Passed TIMECOP


TIMECOP iterations: 1

Number of similar (implementation,compiler) pairs: 9, namely:
ImplementationCompiler
refclang -march=native -O2 -fwrapv -Qunused-arguments -fPIC -fPIE -gdwarf-4 -Wall (Ubuntu_Clang_18.1.3_(1ubuntu1))
refclang -march=native -O3 -fwrapv -Qunused-arguments -fPIC -fPIE -gdwarf-4 -Wall (Ubuntu_Clang_18.1.3_(1ubuntu1))
refclang -march=native -O -fwrapv -Qunused-arguments -fPIC -fPIE -gdwarf-4 -Wall (Ubuntu_Clang_18.1.3_(1ubuntu1))
refclang -march=native -Os -fwrapv -Qunused-arguments -fPIC -fPIE -gdwarf-4 -Wall (Ubuntu_Clang_18.1.3_(1ubuntu1))
refclang -mcpu=native -O3 -fwrapv -Qunused-arguments -fPIC -fPIE -gdwarf-4 -Wall (Ubuntu_Clang_18.1.3_(1ubuntu1))
refgcc -march=native -mtune=native -O2 -fwrapv -fPIC -fPIE -gdwarf-4 -Wall (13.3.0)
refgcc -march=native -mtune=native -O3 -fwrapv -fPIC -fPIE -gdwarf-4 -Wall (13.3.0)
refgcc -march=native -mtune=native -O -fwrapv -fPIC -fPIE -gdwarf-4 -Wall (13.3.0)
refgcc -march=native -mtune=native -Os -fwrapv -fPIC -fPIE -gdwarf-4 -Wall (13.3.0)