Test results for amd64, h2atom, crypto_aead/morus640128v2
[Page version: 20260919 18:54:16]
Measurements for amd64, h2atom, crypto_aead
Test results for amd64, h2atom, crypto_aead
Test results for crypto_aead/morus640128v2
Computer: h2atom
Microarchitecture: amd64; Bonnell (106ca)
Architecture: amd64
CPU ID: GenuineIntel-000106ca-bfe9fbff
SUPERCOP version: 20260330
Operation: crypto_aead
Primitive: morus640128v2
| Time | Object size | Test size | Implementation | Compiler | Benchmark date | SUPERCOP version |
| 18475 | 6648 0 0 | 30724 1240 1608 | T:sse2 | clang -march=native -O -fwrapv -Qunused-arguments -fPIC -fPIE -gdwarf-4 -Wall | 20260520 | 20260330 |
| 18918 | 6437 0 0 | 31932 1240 1608 | T:sse2 | clang -march=native -O2 -fwrapv -Qunused-arguments -fPIC -fPIE -gdwarf-4 -Wall | 20260520 | 20260330 |
| 19130 | 6485 0 0 | 33172 1240 1608 | T:sse2 | clang -march=native -O3 -fwrapv -Qunused-arguments -fPIC -fPIE -gdwarf-4 -Wall | 20260520 | 20260330 |
| 19936 | 5490 0 0 | 28910 1232 1608 | T:sse2 | clang -march=native -Os -fwrapv -Qunused-arguments -fPIC -fPIE -gdwarf-4 -Wall | 20260520 | 20260330 |
| 21732 | 6423 0 0 | 33028 1240 1608 | T:sse2 | clang -mcpu=native -O3 -fwrapv -Qunused-arguments -fPIC -fPIE -gdwarf-4 -Wall | 20260520 | 20260330 |
| 23497 | 5393 0 0 | 32425 1240 1704 | T:sse2 | gcc -march=native -mtune=native -O3 -fwrapv -fPIC -fPIE -gdwarf-4 -Wall | 20260520 | 20260330 |
| 24300 | 2703 0 0 | 28665 1240 1704 | T:sse2 | gcc -march=native -mtune=native -O2 -fwrapv -fPIC -fPIE -gdwarf-4 -Wall | 20260520 | 20260330 |
| 25052 | 1996 0 0 | 25799 1216 1672 | T:sse2 | gcc -march=native -mtune=native -Os -fwrapv -fPIC -fPIE -gdwarf-4 -Wall | 20260520 | 20260330 |
| 27205 | 2572 0 0 | 27816 1232 1704 | T:sse2 | gcc -march=native -mtune=native -O -fwrapv -fPIC -fPIE -gdwarf-4 -Wall | 20260520 | 20260330 |
| 60211 | 11718 0 0 | 38642 1232 1704 | T:ref | gcc -march=native -mtune=native -O3 -fwrapv -fPIC -fPIE -gdwarf-4 -Wall | 20260520 | 20260330 |
Compiler output
encrypt.c: encrypt.c:242:16: warning: unused variable 'check' [-Wunused-variable]
encrypt.c: 242 | unsigned char check = 0;
encrypt.c: | ^~~~~
encrypt.c: 1 warning generated.
try.c: /usr/bin/ld: libcrypto_aead_morus640128v2.a(encrypt.o): in function `morus_initialization':
try.c: .../supercop-data/h2atom/amd64/try/c/clang_-march=native_-O2_-fwrapv_-Qunused-arguments_-fPIC_-fPIE_-gdwarf-4_-Wall/timingleaks/crypto_aead/morus640128v2/ref/work/encrypt.c:67:(.text+0x...): undefined reference to `morus_stateupdate'
try.c: /usr/bin/ld: .../supercop-data/h2atom/amd64/try/c/clang_-march=native_-O2_-fwrapv_-Qunused-arguments_-fPIC_-fPIE_-gdwarf-4_-Wall/timingleaks/crypto_aead/morus640128v2/ref/work/encrypt.c:67:(.text+0x...): undefined reference to `morus_stateupdate'
try.c: /usr/bin/ld: .../supercop-data/h2atom/amd64/try/c/clang_-march=native_-O2_-fwrapv_-Qunused-arguments_-fPIC_-fPIE_-gdwarf-4_-Wall/timingleaks/crypto_aead/morus640128v2/ref/work/encrypt.c:67:(.text+0x...): undefined reference to `morus_stateupdate'
try.c: /usr/bin/ld: .../supercop-data/h2atom/amd64/try/c/clang_-march=native_-O2_-fwrapv_-Qunused-arguments_-fPIC_-fPIE_-gdwarf-4_-Wall/timingleaks/crypto_aead/morus640128v2/ref/work/encrypt.c:67:(.text+0x...): undefined reference to `morus_stateupdate'
try.c: /usr/bin/ld: .../supercop-data/h2atom/amd64/try/c/clang_-march=native_-O2_-fwrapv_-Qunused-arguments_-fPIC_-fPIE_-gdwarf-4_-Wall/timingleaks/crypto_aead/morus640128v2/ref/work/encrypt.c:67:(.text+0x...): undefined reference to `morus_stateupdate'
try.c: /usr/bin/ld: libcrypto_aead_morus640128v2.a(encrypt.o):.../supercop-data/h2atom/amd64/try/c/clang_-march=native_-O2_-fwrapv_-Qunused-arguments_-fPIC_-fPIE_-gdwarf-4_-Wall/timingleaks/crypto_aead/morus640128v2/ref/work/encrypt.c:67: more undefined references to `morus_stateupdate' follow
try.c: clang: error: linker command failed with exit code 1 (use -v to see invocation)
Number of similar (implementation,compiler) pairs: 1, namely:
| Implementation | Compiler |
| T:ref | clang -march=native -O2 -fwrapv -Qunused-arguments -fPIC -fPIE -gdwarf-4 -Wall (Ubuntu_Clang_18.1.3_(1ubuntu1)) |
Compiler output
encrypt.c: encrypt.c:242:16: warning: unused variable 'check' [-Wunused-variable]
encrypt.c: 242 | unsigned char check = 0;
encrypt.c: | ^~~~~
encrypt.c: 1 warning generated.
try.c: /usr/bin/ld: libcrypto_aead_morus640128v2.a(encrypt.o): in function `morus_initialization':
try.c: .../supercop-data/h2atom/amd64/try/c/clang_-march=native_-O3_-fwrapv_-Qunused-arguments_-fPIC_-fPIE_-gdwarf-4_-Wall/timingleaks/crypto_aead/morus640128v2/ref/work/encrypt.c:67:(.text+0x...): undefined reference to `morus_stateupdate'
try.c: /usr/bin/ld: .../supercop-data/h2atom/amd64/try/c/clang_-march=native_-O3_-fwrapv_-Qunused-arguments_-fPIC_-fPIE_-gdwarf-4_-Wall/timingleaks/crypto_aead/morus640128v2/ref/work/encrypt.c:67:(.text+0x...): undefined reference to `morus_stateupdate'
try.c: /usr/bin/ld: .../supercop-data/h2atom/amd64/try/c/clang_-march=native_-O3_-fwrapv_-Qunused-arguments_-fPIC_-fPIE_-gdwarf-4_-Wall/timingleaks/crypto_aead/morus640128v2/ref/work/encrypt.c:67:(.text+0x...): undefined reference to `morus_stateupdate'
try.c: /usr/bin/ld: .../supercop-data/h2atom/amd64/try/c/clang_-march=native_-O3_-fwrapv_-Qunused-arguments_-fPIC_-fPIE_-gdwarf-4_-Wall/timingleaks/crypto_aead/morus640128v2/ref/work/encrypt.c:67:(.text+0x...): undefined reference to `morus_stateupdate'
try.c: /usr/bin/ld: .../supercop-data/h2atom/amd64/try/c/clang_-march=native_-O3_-fwrapv_-Qunused-arguments_-fPIC_-fPIE_-gdwarf-4_-Wall/timingleaks/crypto_aead/morus640128v2/ref/work/encrypt.c:67:(.text+0x...): undefined reference to `morus_stateupdate'
try.c: /usr/bin/ld: libcrypto_aead_morus640128v2.a(encrypt.o):.../supercop-data/h2atom/amd64/try/c/clang_-march=native_-O3_-fwrapv_-Qunused-arguments_-fPIC_-fPIE_-gdwarf-4_-Wall/timingleaks/crypto_aead/morus640128v2/ref/work/encrypt.c:67: more undefined references to `morus_stateupdate' follow
try.c: clang: error: linker command failed with exit code 1 (use -v to see invocation)
Number of similar (implementation,compiler) pairs: 1, namely:
| Implementation | Compiler |
| T:ref | clang -march=native -O3 -fwrapv -Qunused-arguments -fPIC -fPIE -gdwarf-4 -Wall (Ubuntu_Clang_18.1.3_(1ubuntu1)) |
Compiler output
encrypt.c: encrypt.c:242:16: warning: unused variable 'check' [-Wunused-variable]
encrypt.c: 242 | unsigned char check = 0;
encrypt.c: | ^~~~~
encrypt.c: 1 warning generated.
try.c: /usr/bin/ld: libcrypto_aead_morus640128v2.a(encrypt.o): in function `morus_initialization':
try.c: .../supercop-data/h2atom/amd64/try/c/clang_-march=native_-O_-fwrapv_-Qunused-arguments_-fPIC_-fPIE_-gdwarf-4_-Wall/timingleaks/crypto_aead/morus640128v2/ref/work/encrypt.c:67:(.text+0x...): undefined reference to `morus_stateupdate'
try.c: /usr/bin/ld: libcrypto_aead_morus640128v2.a(encrypt.o): in function `morus_tag_generation':
try.c: .../supercop-data/h2atom/amd64/try/c/clang_-march=native_-O_-fwrapv_-Qunused-arguments_-fPIC_-fPIE_-gdwarf-4_-Wall/timingleaks/crypto_aead/morus640128v2/ref/work/encrypt.c:82:(.text+0x...): undefined reference to `morus_stateupdate'
try.c: /usr/bin/ld: libcrypto_aead_morus640128v2.a(encrypt.o): in function `morus_tag_verification':
try.c: .../supercop-data/h2atom/amd64/try/c/clang_-march=native_-O_-fwrapv_-Qunused-arguments_-fPIC_-fPIE_-gdwarf-4_-Wall/timingleaks/crypto_aead/morus640128v2/ref/work/encrypt.c:102:(.text+0x...): undefined reference to `morus_stateupdate'
try.c: /usr/bin/ld: libcrypto_aead_morus640128v2.a(encrypt.o): in function `morus_enc_aut_partialblock':
try.c: .../supercop-data/h2atom/amd64/try/c/clang_-march=native_-O_-fwrapv_-Qunused-arguments_-fPIC_-fPIE_-gdwarf-4_-Wall/timingleaks/crypto_aead/morus640128v2/ref/work/encrypt.c:155:(.text+0x...): undefined reference to `morus_stateupdate'
try.c: /usr/bin/ld: libcrypto_aead_morus640128v2.a(encrypt.o): in function `morus_dec_aut_partialblock':
try.c: .../supercop-data/h2atom/amd64/try/c/clang_-march=native_-O_-fwrapv_-Qunused-arguments_-fPIC_-fPIE_-gdwarf-4_-Wall/timingleaks/crypto_aead/morus640128v2/ref/work/encrypt.c:179:(.text+0x...): undefined reference to `morus_stateupdate'
try.c: clang: error: linker command failed with exit code 1 (use -v to see invocation)
Number of similar (implementation,compiler) pairs: 1, namely:
| Implementation | Compiler |
| T:ref | clang -march=native -O -fwrapv -Qunused-arguments -fPIC -fPIE -gdwarf-4 -Wall (Ubuntu_Clang_18.1.3_(1ubuntu1)) |
Compiler output
encrypt.c: encrypt.c:242:16: warning: unused variable 'check' [-Wunused-variable]
encrypt.c: 242 | unsigned char check = 0;
encrypt.c: | ^~~~~
encrypt.c: 1 warning generated.
try.c: /usr/bin/ld: libcrypto_aead_morus640128v2.a(encrypt.o): in function `morus_initialization':
try.c: .../supercop-data/h2atom/amd64/try/c/clang_-march=native_-Os_-fwrapv_-Qunused-arguments_-fPIC_-fPIE_-gdwarf-4_-Wall/timingleaks/crypto_aead/morus640128v2/ref/work/encrypt.c:67:(.text+0x...): undefined reference to `morus_stateupdate'
try.c: /usr/bin/ld: libcrypto_aead_morus640128v2.a(encrypt.o): in function `morus_tag_generation':
try.c: .../supercop-data/h2atom/amd64/try/c/clang_-march=native_-Os_-fwrapv_-Qunused-arguments_-fPIC_-fPIE_-gdwarf-4_-Wall/timingleaks/crypto_aead/morus640128v2/ref/work/encrypt.c:82:(.text+0x...): undefined reference to `morus_stateupdate'
try.c: /usr/bin/ld: libcrypto_aead_morus640128v2.a(encrypt.o): in function `morus_tag_verification':
try.c: .../supercop-data/h2atom/amd64/try/c/clang_-march=native_-Os_-fwrapv_-Qunused-arguments_-fPIC_-fPIE_-gdwarf-4_-Wall/timingleaks/crypto_aead/morus640128v2/ref/work/encrypt.c:102:(.text+0x...): undefined reference to `morus_stateupdate'
try.c: /usr/bin/ld: libcrypto_aead_morus640128v2.a(encrypt.o): in function `morus_enc_aut_partialblock':
try.c: .../supercop-data/h2atom/amd64/try/c/clang_-march=native_-Os_-fwrapv_-Qunused-arguments_-fPIC_-fPIE_-gdwarf-4_-Wall/timingleaks/crypto_aead/morus640128v2/ref/work/encrypt.c:155:(.text+0x...): undefined reference to `morus_stateupdate'
try.c: /usr/bin/ld: libcrypto_aead_morus640128v2.a(encrypt.o): in function `morus_dec_aut_partialblock':
try.c: .../supercop-data/h2atom/amd64/try/c/clang_-march=native_-Os_-fwrapv_-Qunused-arguments_-fPIC_-fPIE_-gdwarf-4_-Wall/timingleaks/crypto_aead/morus640128v2/ref/work/encrypt.c:179:(.text+0x...): undefined reference to `morus_stateupdate'
try.c: clang: error: linker command failed with exit code 1 (use -v to see invocation)
Number of similar (implementation,compiler) pairs: 1, namely:
| Implementation | Compiler |
| T:ref | clang -march=native -Os -fwrapv -Qunused-arguments -fPIC -fPIE -gdwarf-4 -Wall (Ubuntu_Clang_18.1.3_(1ubuntu1)) |
Compiler output
encrypt.c: encrypt.c:242:16: warning: unused variable 'check' [-Wunused-variable]
encrypt.c: 242 | unsigned char check = 0;
encrypt.c: | ^~~~~
encrypt.c: 1 warning generated.
try.c: /usr/bin/ld: libcrypto_aead_morus640128v2.a(encrypt.o): in function `morus_initialization':
try.c: .../supercop-data/h2atom/amd64/try/c/clang_-mcpu=native_-O3_-fwrapv_-Qunused-arguments_-fPIC_-fPIE_-gdwarf-4_-Wall/timingleaks/crypto_aead/morus640128v2/ref/work/encrypt.c:67:(.text+0x...): undefined reference to `morus_stateupdate'
try.c: /usr/bin/ld: .../supercop-data/h2atom/amd64/try/c/clang_-mcpu=native_-O3_-fwrapv_-Qunused-arguments_-fPIC_-fPIE_-gdwarf-4_-Wall/timingleaks/crypto_aead/morus640128v2/ref/work/encrypt.c:67:(.text+0x...): undefined reference to `morus_stateupdate'
try.c: /usr/bin/ld: .../supercop-data/h2atom/amd64/try/c/clang_-mcpu=native_-O3_-fwrapv_-Qunused-arguments_-fPIC_-fPIE_-gdwarf-4_-Wall/timingleaks/crypto_aead/morus640128v2/ref/work/encrypt.c:67:(.text+0x...): undefined reference to `morus_stateupdate'
try.c: /usr/bin/ld: .../supercop-data/h2atom/amd64/try/c/clang_-mcpu=native_-O3_-fwrapv_-Qunused-arguments_-fPIC_-fPIE_-gdwarf-4_-Wall/timingleaks/crypto_aead/morus640128v2/ref/work/encrypt.c:67:(.text+0x...): undefined reference to `morus_stateupdate'
try.c: /usr/bin/ld: .../supercop-data/h2atom/amd64/try/c/clang_-mcpu=native_-O3_-fwrapv_-Qunused-arguments_-fPIC_-fPIE_-gdwarf-4_-Wall/timingleaks/crypto_aead/morus640128v2/ref/work/encrypt.c:67:(.text+0x...): undefined reference to `morus_stateupdate'
try.c: /usr/bin/ld: libcrypto_aead_morus640128v2.a(encrypt.o):.../supercop-data/h2atom/amd64/try/c/clang_-mcpu=native_-O3_-fwrapv_-Qunused-arguments_-fPIC_-fPIE_-gdwarf-4_-Wall/timingleaks/crypto_aead/morus640128v2/ref/work/encrypt.c:67: more undefined references to `morus_stateupdate' follow
try.c: clang: error: linker command failed with exit code 1 (use -v to see invocation)
Number of similar (implementation,compiler) pairs: 1, namely:
| Implementation | Compiler |
| T:ref | clang -mcpu=native -O3 -fwrapv -Qunused-arguments -fPIC -fPIE -gdwarf-4 -Wall (Ubuntu_Clang_18.1.3_(1ubuntu1)) |
Compiler output
encrypt.c: encrypt.c: In function 'crypto_aead_morus640128v2_ref_timingleaks_decrypt':
encrypt.c: encrypt.c:242:23: warning: unused variable 'check' [-Wunused-variable]
encrypt.c: 242 | unsigned char check = 0;
encrypt.c: | ^~~~~
try.c: /usr/bin/ld: libcrypto_aead_morus640128v2.a(encrypt.o): in function `morus_initialization':
try.c: .../supercop-data/h2atom/amd64/try/c/gcc_-march=native_-mtune=native_-O2_-fwrapv_-fPIC_-fPIE_-gdwarf-4_-Wall/timingleaks/crypto_aead/morus640128v2/ref/work/encrypt.c:67:(.text+0x...): undefined reference to `morus_stateupdate'
try.c: /usr/bin/ld: libcrypto_aead_morus640128v2.a(encrypt.o): in function `morus_tag_generation':
try.c: .../supercop-data/h2atom/amd64/try/c/gcc_-march=native_-mtune=native_-O2_-fwrapv_-fPIC_-fPIE_-gdwarf-4_-Wall/timingleaks/crypto_aead/morus640128v2/ref/work/encrypt.c:82:(.text+0x...): undefined reference to `morus_stateupdate'
try.c: /usr/bin/ld: libcrypto_aead_morus640128v2.a(encrypt.o): in function `morus_tag_verification':
try.c: .../supercop-data/h2atom/amd64/try/c/gcc_-march=native_-mtune=native_-O2_-fwrapv_-fPIC_-fPIE_-gdwarf-4_-Wall/timingleaks/crypto_aead/morus640128v2/ref/work/encrypt.c:102:(.text+0x...): undefined reference to `morus_stateupdate'
try.c: /usr/bin/ld: libcrypto_aead_morus640128v2.a(encrypt.o): in function `morus_enc_aut_partialblock':
try.c: .../supercop-data/h2atom/amd64/try/c/gcc_-march=native_-mtune=native_-O2_-fwrapv_-fPIC_-fPIE_-gdwarf-4_-Wall/timingleaks/crypto_aead/morus640128v2/ref/work/encrypt.c:155:(.text+0x...): undefined reference to `morus_stateupdate'
try.c: /usr/bin/ld: libcrypto_aead_morus640128v2.a(encrypt.o): in function `morus_dec_aut_partialblock':
try.c: .../supercop-data/h2atom/amd64/try/c/gcc_-march=native_-mtune=native_-O2_-fwrapv_-fPIC_-fPIE_-gdwarf-4_-Wall/timingleaks/crypto_aead/morus640128v2/ref/work/encrypt.c:179:(.text+0x...): undefined reference to `morus_stateupdate'
try.c: /usr/bin/ld: libcrypto_aead_morus640128v2.a(encrypt.o):.../supercop-data/h2atom/amd64/try/c/gcc_-march=native_-mtune=native_-O2_-fwrapv_-fPIC_-fPIE_-gdwarf-4_-Wall/timingleaks/crypto_aead/morus640128v2/ref/work/encrypt.c:124: more undefined references to `morus_stateupdate' follow
try.c: collect2: error: ld returned 1 exit status
Number of similar (implementation,compiler) pairs: 1, namely:
| Implementation | Compiler |
| T:ref | gcc -march=native -mtune=native -O2 -fwrapv -fPIC -fPIE -gdwarf-4 -Wall (13.3.0) |
Compiler output
encrypt.c: encrypt.c: In function 'crypto_aead_morus640128v2_ref_timingleaks_decrypt':
encrypt.c: encrypt.c:242:23: warning: unused variable 'check' [-Wunused-variable]
encrypt.c: 242 | unsigned char check = 0;
encrypt.c: | ^~~~~
Number of similar (implementation,compiler) pairs: 1, namely:
| Implementation | Compiler |
| T:ref | gcc -march=native -mtune=native -O3 -fwrapv -fPIC -fPIE -gdwarf-4 -Wall (13.3.0) |
Compiler output
encrypt.c: encrypt.c: In function 'crypto_aead_morus640128v2_ref_timingleaks_decrypt':
encrypt.c: encrypt.c:242:23: warning: unused variable 'check' [-Wunused-variable]
encrypt.c: 242 | unsigned char check = 0;
encrypt.c: | ^~~~~
try.c: /usr/bin/ld: libcrypto_aead_morus640128v2.a(encrypt.o): in function `morus_initialization':
try.c: .../supercop-data/h2atom/amd64/try/c/gcc_-march=native_-mtune=native_-O_-fwrapv_-fPIC_-fPIE_-gdwarf-4_-Wall/timingleaks/crypto_aead/morus640128v2/ref/work/encrypt.c:67:(.text+0x...): undefined reference to `morus_stateupdate'
try.c: /usr/bin/ld: libcrypto_aead_morus640128v2.a(encrypt.o): in function `morus_tag_generation':
try.c: .../supercop-data/h2atom/amd64/try/c/gcc_-march=native_-mtune=native_-O_-fwrapv_-fPIC_-fPIE_-gdwarf-4_-Wall/timingleaks/crypto_aead/morus640128v2/ref/work/encrypt.c:82:(.text+0x...): undefined reference to `morus_stateupdate'
try.c: /usr/bin/ld: libcrypto_aead_morus640128v2.a(encrypt.o): in function `morus_tag_verification':
try.c: .../supercop-data/h2atom/amd64/try/c/gcc_-march=native_-mtune=native_-O_-fwrapv_-fPIC_-fPIE_-gdwarf-4_-Wall/timingleaks/crypto_aead/morus640128v2/ref/work/encrypt.c:102:(.text+0x...): undefined reference to `morus_stateupdate'
try.c: /usr/bin/ld: libcrypto_aead_morus640128v2.a(encrypt.o): in function `morus_enc_aut_partialblock':
try.c: .../supercop-data/h2atom/amd64/try/c/gcc_-march=native_-mtune=native_-O_-fwrapv_-fPIC_-fPIE_-gdwarf-4_-Wall/timingleaks/crypto_aead/morus640128v2/ref/work/encrypt.c:155:(.text+0x...): undefined reference to `morus_stateupdate'
try.c: /usr/bin/ld: libcrypto_aead_morus640128v2.a(encrypt.o): in function `morus_dec_aut_partialblock':
try.c: .../supercop-data/h2atom/amd64/try/c/gcc_-march=native_-mtune=native_-O_-fwrapv_-fPIC_-fPIE_-gdwarf-4_-Wall/timingleaks/crypto_aead/morus640128v2/ref/work/encrypt.c:179:(.text+0x...): undefined reference to `morus_stateupdate'
try.c: /usr/bin/ld: libcrypto_aead_morus640128v2.a(encrypt.o):.../supercop-data/h2atom/amd64/try/c/gcc_-march=native_-mtune=native_-O_-fwrapv_-fPIC_-fPIE_-gdwarf-4_-Wall/timingleaks/crypto_aead/morus640128v2/ref/work/encrypt.c:124: more undefined references to `morus_stateupdate' follow
try.c: collect2: error: ld returned 1 exit status
Number of similar (implementation,compiler) pairs: 1, namely:
| Implementation | Compiler |
| T:ref | gcc -march=native -mtune=native -O -fwrapv -fPIC -fPIE -gdwarf-4 -Wall (13.3.0) |
Compiler output
encrypt.c: encrypt.c: In function 'crypto_aead_morus640128v2_ref_timingleaks_decrypt':
encrypt.c: encrypt.c:242:23: warning: unused variable 'check' [-Wunused-variable]
encrypt.c: 242 | unsigned char check = 0;
encrypt.c: | ^~~~~
try.c: /usr/bin/ld: libcrypto_aead_morus640128v2.a(encrypt.o): in function `morus_initialization':
try.c: .../supercop-data/h2atom/amd64/try/c/gcc_-march=native_-mtune=native_-Os_-fwrapv_-fPIC_-fPIE_-gdwarf-4_-Wall/timingleaks/crypto_aead/morus640128v2/ref/work/encrypt.c:67:(.text+0x...): undefined reference to `morus_stateupdate'
try.c: /usr/bin/ld: libcrypto_aead_morus640128v2.a(encrypt.o): in function `morus_tag_generation':
try.c: .../supercop-data/h2atom/amd64/try/c/gcc_-march=native_-mtune=native_-Os_-fwrapv_-fPIC_-fPIE_-gdwarf-4_-Wall/timingleaks/crypto_aead/morus640128v2/ref/work/encrypt.c:82:(.text+0x...): undefined reference to `morus_stateupdate'
try.c: /usr/bin/ld: libcrypto_aead_morus640128v2.a(encrypt.o): in function `morus_tag_verification':
try.c: .../supercop-data/h2atom/amd64/try/c/gcc_-march=native_-mtune=native_-Os_-fwrapv_-fPIC_-fPIE_-gdwarf-4_-Wall/timingleaks/crypto_aead/morus640128v2/ref/work/encrypt.c:102:(.text+0x...): undefined reference to `morus_stateupdate'
try.c: /usr/bin/ld: libcrypto_aead_morus640128v2.a(encrypt.o): in function `morus_enc_aut_partialblock':
try.c: .../supercop-data/h2atom/amd64/try/c/gcc_-march=native_-mtune=native_-Os_-fwrapv_-fPIC_-fPIE_-gdwarf-4_-Wall/timingleaks/crypto_aead/morus640128v2/ref/work/encrypt.c:155:(.text+0x...): undefined reference to `morus_stateupdate'
try.c: /usr/bin/ld: libcrypto_aead_morus640128v2.a(encrypt.o): in function `morus_dec_aut_partialblock':
try.c: .../supercop-data/h2atom/amd64/try/c/gcc_-march=native_-mtune=native_-Os_-fwrapv_-fPIC_-fPIE_-gdwarf-4_-Wall/timingleaks/crypto_aead/morus640128v2/ref/work/encrypt.c:179:(.text+0x...): undefined reference to `morus_stateupdate'
try.c: /usr/bin/ld: libcrypto_aead_morus640128v2.a(encrypt.o): in function `crypto_aead_morus640128v2_ref_timingleaks_encrypt':
try.c: .../supercop-data/h2atom/amd64/try/c/gcc_-march=native_-mtune=native_-Os_-fwrapv_-fPIC_-fPIE_-gdwarf-4_-Wall/timingleaks/crypto_aead/morus640128v2/ref/work/encrypt.c:203:(.text+0x...): undefined reference to `morus_enc_aut_step'
try.c: /usr/bin/ld: .../supercop-data/h2atom/amd64/try/c/gcc_-march=native_-mtune=native_-Os_-fwrapv_-fPIC_-fPIE_-gdwarf-4_-Wall/timingleaks/crypto_aead/morus640128v2/ref/work/encrypt.c:214:(.text+0x...): undefined reference to `morus_enc_aut_step'
try.c: /usr/bin/ld: libcrypto_aead_morus640128v2.a(encrypt.o): in function `crypto_aead_morus640128v2_ref_timingleaks_decrypt':
try.c: .../supercop-data/h2atom/amd64/try/c/gcc_-march=native_-mtune=native_-Os_-fwrapv_-fPIC_-fPIE_-gdwarf-4_-Wall/timingleaks/crypto_aead/morus640128v2/ref/work/encrypt.c:251:(.text+0x...): undefined reference to `morus_enc_aut_step'
try.c: /usr/bin/ld: .../supercop-data/h2atom/amd64/try/c/gcc_-march=native_-mtune=native_-Os_-fwrapv_-fPIC_-fPIE_-gdwarf-4_-Wall/timingleaks/crypto_aead/morus640128v2/ref/work/encrypt.c:263:(.text+0x...): undefined reference to `morus_dec_aut_step'
try.c: collect2: error: ld returned 1 exit status
Number of similar (implementation,compiler) pairs: 1, namely:
| Implementation | Compiler |
| T:ref | gcc -march=native -mtune=native -Os -fwrapv -fPIC -fPIE -gdwarf-4 -Wall (13.3.0) |
Namespace violations
encrypt.o morus_dec_aut_partialblock T
encrypt.o morus_enc_aut_partialblock T
encrypt.o morus_initialization T
encrypt.o morus_tag_generation T
encrypt.o morus_tag_verification T
Number of similar (implementation,compiler) pairs: 1, namely:
| Implementation | Compiler |
| T:ref | gcc -march=native -mtune=native -O3 -fwrapv -fPIC -fPIE -gdwarf-4 -Wall (13.3.0) |
Namespace violations
encrypt.o morus_dec_aut_partialblock T
encrypt.o morus_enc_aut_partialblock T
encrypt.o morus_initialization T
encrypt.o morus_stateupdate T
encrypt.o morus_tag_generation T
encrypt.o morus_tag_verification T
Number of similar (implementation,compiler) pairs: 9, namely:
| Implementation | Compiler |
| T:sse2 | clang -march=native -O2 -fwrapv -Qunused-arguments -fPIC -fPIE -gdwarf-4 -Wall (Ubuntu_Clang_18.1.3_(1ubuntu1)) |
| T:sse2 | clang -march=native -O3 -fwrapv -Qunused-arguments -fPIC -fPIE -gdwarf-4 -Wall (Ubuntu_Clang_18.1.3_(1ubuntu1)) |
| T:sse2 | clang -march=native -O -fwrapv -Qunused-arguments -fPIC -fPIE -gdwarf-4 -Wall (Ubuntu_Clang_18.1.3_(1ubuntu1)) |
| T:sse2 | clang -march=native -Os -fwrapv -Qunused-arguments -fPIC -fPIE -gdwarf-4 -Wall (Ubuntu_Clang_18.1.3_(1ubuntu1)) |
| T:sse2 | clang -mcpu=native -O3 -fwrapv -Qunused-arguments -fPIC -fPIE -gdwarf-4 -Wall (Ubuntu_Clang_18.1.3_(1ubuntu1)) |
| T:sse2 | gcc -march=native -mtune=native -O2 -fwrapv -fPIC -fPIE -gdwarf-4 -Wall (13.3.0) |
| T:sse2 | gcc -march=native -mtune=native -O3 -fwrapv -fPIC -fPIE -gdwarf-4 -Wall (13.3.0) |
| T:sse2 | gcc -march=native -mtune=native -O -fwrapv -fPIC -fPIE -gdwarf-4 -Wall (13.3.0) |
| T:sse2 | gcc -march=native -mtune=native -Os -fwrapv -fPIC -fPIE -gdwarf-4 -Wall (13.3.0) |