Test results for amd64, cherry, crypto_kem/ntruhps4096821
[Page version: 20250403 07:20:01]
Measurements for amd64, cherry, crypto_kem
Test results for amd64, cherry, crypto_kem
Test results for crypto_kem/ntruhps4096821
Computer: cherry
Microarchitecture: amd64; Silvermont (406c4)
Architecture: amd64
CPU ID: GenuineIntel-000406c4-bfebfbff
SUPERCOP version: 20250307
Operation: crypto_kem
Primitive: ntruhps4096821
Time | Object size | Test size | Implementation | Compiler | Benchmark date | SUPERCOP version |
4044508 | 30333 0 0 | 122176 820 1720 | T:compact | clang -mcpu=native -O3 -fwrapv -Qunused-arguments -fPIC -fPIE -gdwarf-4 -Wall | 20250327 | 20250307 |
4160268 | 30333 0 0 | 130224 820 1720 | compact | clang -mcpu=native -O3 -fwrapv -Qunused-arguments -fPIC -fPIE -gdwarf-4 -Wall | 20250327 | 20250307 |
4413604 | 18788 0 0 | 109336 820 1720 | T:compact | clang -march=native -O2 -fwrapv -Qunused-arguments -fPIC -fPIE -gdwarf-4 -Wall | 20250327 | 20250307 |
4444211 | 27457 0 0 | 119640 820 1720 | T:compact | clang -march=native -O3 -fwrapv -Qunused-arguments -fPIC -fPIE -gdwarf-4 -Wall | 20250327 | 20250307 |
4560597 | 27457 0 0 | 127688 820 1720 | compact | clang -march=native -O3 -fwrapv -Qunused-arguments -fPIC -fPIE -gdwarf-4 -Wall | 20250327 | 20250307 |
4603072 | 18788 0 0 | 117384 820 1720 | compact | clang -march=native -O2 -fwrapv -Qunused-arguments -fPIC -fPIE -gdwarf-4 -Wall | 20250327 | 20250307 |
13116645 | 6674 0 0 | 96510 812 1720 | T:ref | clang -march=native -O -fwrapv -Qunused-arguments -fPIC -fPIE -gdwarf-4 -Wall | 20250327 | 20250307 |
13306704 | 6674 0 0 | 104574 812 1720 | ref | clang -march=native -O -fwrapv -Qunused-arguments -fPIC -fPIE -gdwarf-4 -Wall | 20250327 | 20250307 |
14300612 | 16285 0 0 | 108592 820 1720 | T:ref | clang -march=native -O3 -fwrapv -Qunused-arguments -fPIC -fPIE -gdwarf-4 -Wall | 20250327 | 20250307 |
14305131 | 11005 0 0 | 101616 820 1720 | T:ref | clang -march=native -O2 -fwrapv -Qunused-arguments -fPIC -fPIE -gdwarf-4 -Wall | 20250327 | 20250307 |
14392403 | 16285 0 0 | 116640 820 1720 | ref | clang -march=native -O3 -fwrapv -Qunused-arguments -fPIC -fPIE -gdwarf-4 -Wall | 20250327 | 20250307 |
14475077 | 11005 0 0 | 109728 820 1720 | ref | clang -march=native -O2 -fwrapv -Qunused-arguments -fPIC -fPIE -gdwarf-4 -Wall | 20250327 | 20250307 |
14741189 | 17706 0 0 | 109624 820 1720 | T:ref | clang -mcpu=native -O3 -fwrapv -Qunused-arguments -fPIC -fPIE -gdwarf-4 -Wall | 20250327 | 20250307 |
14874786 | 6346 0 0 | 104438 812 1720 | compact | clang -march=native -O -fwrapv -Qunused-arguments -fPIC -fPIE -gdwarf-4 -Wall | 20250327 | 20250307 |
14984592 | 17706 0 0 | 117672 820 1720 | ref | clang -mcpu=native -O3 -fwrapv -Qunused-arguments -fPIC -fPIE -gdwarf-4 -Wall | 20250327 | 20250307 |
15037967 | 6346 0 0 | 96374 812 1720 | T:compact | clang -march=native -O -fwrapv -Qunused-arguments -fPIC -fPIE -gdwarf-4 -Wall | 20250327 | 20250307 |
15171550 | 5710 0 0 | 94862 812 1720 | T:ref | clang -march=native -Os -fwrapv -Qunused-arguments -fPIC -fPIE -gdwarf-4 -Wall | 20250327 | 20250307 |
15263399 | 5710 0 0 | 102910 812 1720 | ref | clang -march=native -Os -fwrapv -Qunused-arguments -fPIC -fPIE -gdwarf-4 -Wall | 20250327 | 20250307 |
16107542 | 4775 0 0 | 94054 812 1720 | T:compact | clang -march=native -Os -fwrapv -Qunused-arguments -fPIC -fPIE -gdwarf-4 -Wall | 20250327 | 20250307 |
16182086 | 4775 0 0 | 102102 812 1720 | compact | clang -march=native -Os -fwrapv -Qunused-arguments -fPIC -fPIE -gdwarf-4 -Wall | 20250327 | 20250307 |
Compiler output
poly_s3_inv.c: poly_s3_inv.c:418:11: error: always_inline function '_mm256_set_epi32' requires target feature 'avx', but would be inlined into function '__poly_S3_inv' that is compiled without support for 'avx'
poly_s3_inv.c: F0[0] = _mm256_set_epi32(-1,-1,-1,-1,-1,-1,-1,-1);
poly_s3_inv.c: ^
poly_s3_inv.c: poly_s3_inv.c:418:11: error: AVX vector return of type '__m256i' (vector of 4 'long long' values) without 'avx' enabled changes the ABI
poly_s3_inv.c: poly_s3_inv.c:419:11: error: always_inline function '_mm256_set_epi32' requires target feature 'avx', but would be inlined into function '__poly_S3_inv' that is compiled without support for 'avx'
poly_s3_inv.c: F0[1] = _mm256_set_epi32(-1,-1,-1,-1,-1,-1,-1,-1);
poly_s3_inv.c: ^
poly_s3_inv.c: poly_s3_inv.c:419:11: error: AVX vector return of type '__m256i' (vector of 4 'long long' values) without 'avx' enabled changes the ABI
poly_s3_inv.c: poly_s3_inv.c:420:11: error: always_inline function '_mm256_set_epi32' requires target feature 'avx', but would be inlined into function '__poly_S3_inv' that is compiled without support for 'avx'
poly_s3_inv.c: F0[2] = _mm256_set_epi32(-1,-1,-1,-1,-1,-1,-1,-1);
poly_s3_inv.c: ^
poly_s3_inv.c: poly_s3_inv.c:420:11: error: AVX vector return of type '__m256i' (vector of 4 'long long' values) without 'avx' enabled changes the ABI
poly_s3_inv.c: poly_s3_inv.c:421:11: error: always_inline function '_mm256_set_epi32' requires target feature 'avx', but would be inlined into function '__poly_S3_inv' that is compiled without support for 'avx'
poly_s3_inv.c: F0[3] = _mm256_set_epi32(0,8191,0,8191,0,8191,0,16383);
poly_s3_inv.c: ^
poly_s3_inv.c: poly_s3_inv.c:421:11: error: AVX vector return of type '__m256i' (vector of 4 'long long' values) without 'avx' enabled changes the ABI
poly_s3_inv.c: poly_s3_inv.c:422:11: error: always_inline function '_mm256_set1_epi32' requires target feature 'avx', but would be inlined into function '__poly_S3_inv' that is compiled without support for 'avx'
poly_s3_inv.c: F1[0] = _mm256_set1_epi32(0);
poly_s3_inv.c: ^
poly_s3_inv.c: poly_s3_inv.c:422:11: error: AVX vector return of type '__m256i' (vector of 4 'long long' values) without 'avx' enabled changes the ABI
poly_s3_inv.c: poly_s3_inv.c:423:11: error: always_inline function '_mm256_set1_epi32' requires target feature 'avx', but would be inlined into function '__poly_S3_inv' that is compiled without support for 'avx'
poly_s3_inv.c: F1[1] = _mm256_set1_epi32(0);
poly_s3_inv.c: ^
poly_s3_inv.c: poly_s3_inv.c:423:11: error: AVX vector return of type '__m256i' (vector of 4 'long long' values) without 'avx' enabled changes the ABI
poly_s3_inv.c: poly_s3_inv.c:424:11: error: always_inline function '_mm256_set1_epi32' requires target feature 'avx', but would be inlined into function '__poly_S3_inv' that is compiled without support for 'avx'
poly_s3_inv.c: ...
Number of similar (implementation,compiler) pairs: 10, namely:
Implementation | Compiler |
avx2 | clang -march=native -O2 -fwrapv -Qunused-arguments -fPIC -fPIE -gdwarf-4 -Wall (Debian_Clang_11.0.1) |
T:avx2 | clang -march=native -O2 -fwrapv -Qunused-arguments -fPIC -fPIE -gdwarf-4 -Wall (Debian_Clang_11.0.1) |
avx2 | clang -march=native -O3 -fwrapv -Qunused-arguments -fPIC -fPIE -gdwarf-4 -Wall (Debian_Clang_11.0.1) |
T:avx2 | clang -march=native -O3 -fwrapv -Qunused-arguments -fPIC -fPIE -gdwarf-4 -Wall (Debian_Clang_11.0.1) |
avx2 | clang -march=native -O -fwrapv -Qunused-arguments -fPIC -fPIE -gdwarf-4 -Wall (Debian_Clang_11.0.1) |
T:avx2 | clang -march=native -O -fwrapv -Qunused-arguments -fPIC -fPIE -gdwarf-4 -Wall (Debian_Clang_11.0.1) |
avx2 | clang -march=native -Os -fwrapv -Qunused-arguments -fPIC -fPIE -gdwarf-4 -Wall (Debian_Clang_11.0.1) |
T:avx2 | clang -march=native -Os -fwrapv -Qunused-arguments -fPIC -fPIE -gdwarf-4 -Wall (Debian_Clang_11.0.1) |
avx2 | clang -mcpu=native -O3 -fwrapv -Qunused-arguments -fPIC -fPIE -gdwarf-4 -Wall (Debian_Clang_11.0.1) |
T:avx2 | clang -mcpu=native -O3 -fwrapv -Qunused-arguments -fPIC -fPIE -gdwarf-4 -Wall (Debian_Clang_11.0.1) |
Compiler output
poly_s3_inv.c: poly_s3_inv.c: In function '__poly_S3_inv':
poly_s3_inv.c: poly_s3_inv.c:418:9: warning: AVX vector return without AVX enabled changes the ABI [-Wpsabi]
poly_s3_inv.c: 418 | F0[0] = _mm256_set_epi32(-1,-1,-1,-1,-1,-1,-1,-1);
poly_s3_inv.c: | ~~~~~~^~~~~~~~~~~~~~~~~~~~~~~~~~~~~~~~~~~~~~~~~~~
poly_s3_inv.c: poly_s3_inv.c: In function 'vec256_swap':
poly_s3_inv.c: poly_s3_inv.c:178:20: note: the ABI for passing parameters with 32-byte alignment has changed in GCC 4.6
poly_s3_inv.c: 178 | static inline void vec256_swap(vec256 *f,vec256 *g,int len,vec256 mask)
poly_s3_inv.c: | ^~~~~~~~~~~
poly_s3_inv.c: In file included from /usr/lib/gcc/x86_64-linux-gnu/10/include/immintrin.h:53,
poly_s3_inv.c: from poly.h:4,
poly_s3_inv.c: from poly_s3_inv.c:2:
poly_s3_inv.c: poly_s3_inv.c: In function 'vec256_frombits':
poly_s3_inv.c: /usr/lib/gcc/x86_64-linux-gnu/10/include/avx2intrin.h:597:1: error: inlining failed in call to 'always_inline' '_mm256_shuffle_epi32': target specific option mismatch
poly_s3_inv.c: 597 | _mm256_shuffle_epi32 (__m256i __A, const int __mask)
poly_s3_inv.c: | ^~~~~~~~~~~~~~~~~~~~
poly_s3_inv.c: poly_s3_inv.c:69:9: note: called from here
poly_s3_inv.c: 69 | h = _mm256_shuffle_epi32(h,0xd8);
poly_s3_inv.c: | ^~~~~~~~~~~~~~~~~~~~~~~~~~~~
poly_s3_inv.c: In file included from /usr/lib/gcc/x86_64-linux-gnu/10/include/immintrin.h:53,
poly_s3_inv.c: from poly.h:4,
poly_s3_inv.c: from poly_s3_inv.c:2:
poly_s3_inv.c: /usr/lib/gcc/x86_64-linux-gnu/10/include/avx2intrin.h:1068:1: error: inlining failed in call to 'always_inline' '_mm256_permute4x64_epi64': target specific option mismatch
poly_s3_inv.c: 1068 | _mm256_permute4x64_epi64 (__m256i __X, const int __M)
poly_s3_inv.c: | ^~~~~~~~~~~~~~~~~~~~~~~~
poly_s3_inv.c: poly_s3_inv.c:68:9: note: called from here
poly_s3_inv.c: ...
Number of similar (implementation,compiler) pairs: 8, namely:
Implementation | Compiler |
avx2 | gcc -march=native -mtune=native -O2 -fwrapv -fPIC -fPIE -gdwarf-4 -Wall (10.2.1_20210110) |
T:avx2 | gcc -march=native -mtune=native -O2 -fwrapv -fPIC -fPIE -gdwarf-4 -Wall (10.2.1_20210110) |
avx2 | gcc -march=native -mtune=native -O3 -fwrapv -fPIC -fPIE -gdwarf-4 -Wall (10.2.1_20210110) |
T:avx2 | gcc -march=native -mtune=native -O3 -fwrapv -fPIC -fPIE -gdwarf-4 -Wall (10.2.1_20210110) |
avx2 | gcc -march=native -mtune=native -O -fwrapv -fPIC -fPIE -gdwarf-4 -Wall (10.2.1_20210110) |
T:avx2 | gcc -march=native -mtune=native -O -fwrapv -fPIC -fPIE -gdwarf-4 -Wall (10.2.1_20210110) |
avx2 | gcc -march=native -mtune=native -Os -fwrapv -fPIC -fPIE -gdwarf-4 -Wall (10.2.1_20210110) |
T:avx2 | gcc -march=native -mtune=native -Os -fwrapv -fPIC -fPIE -gdwarf-4 -Wall (10.2.1_20210110) |
Compiler output
try.c: /usr/bin/ld: .../supercop-data/cherry/amd64/lib/libsupercop.a(crypto_core_keccakf160064bits_optimized1600AsmX86_64_constbranchindex-KeccakP-1600-x86-64-gas.o): relocation R_X86_64_32S against `.text' can not be used when making a PIE object; recompile with -fPIE
try.c: collect2: error: ld returned 1 exit status
Number of similar (implementation,compiler) pairs: 16, namely:
Implementation | Compiler |
compact | gcc -march=native -mtune=native -O2 -fwrapv -fPIC -fPIE -gdwarf-4 -Wall (10.2.1_20210110) |
T:compact | gcc -march=native -mtune=native -O2 -fwrapv -fPIC -fPIE -gdwarf-4 -Wall (10.2.1_20210110) |
compact | gcc -march=native -mtune=native -O3 -fwrapv -fPIC -fPIE -gdwarf-4 -Wall (10.2.1_20210110) |
T:compact | gcc -march=native -mtune=native -O3 -fwrapv -fPIC -fPIE -gdwarf-4 -Wall (10.2.1_20210110) |
compact | gcc -march=native -mtune=native -O -fwrapv -fPIC -fPIE -gdwarf-4 -Wall (10.2.1_20210110) |
T:compact | gcc -march=native -mtune=native -O -fwrapv -fPIC -fPIE -gdwarf-4 -Wall (10.2.1_20210110) |
compact | gcc -march=native -mtune=native -Os -fwrapv -fPIC -fPIE -gdwarf-4 -Wall (10.2.1_20210110) |
T:compact | gcc -march=native -mtune=native -Os -fwrapv -fPIC -fPIE -gdwarf-4 -Wall (10.2.1_20210110) |
ref | gcc -march=native -mtune=native -O2 -fwrapv -fPIC -fPIE -gdwarf-4 -Wall (10.2.1_20210110) |
T:ref | gcc -march=native -mtune=native -O2 -fwrapv -fPIC -fPIE -gdwarf-4 -Wall (10.2.1_20210110) |
ref | gcc -march=native -mtune=native -O3 -fwrapv -fPIC -fPIE -gdwarf-4 -Wall (10.2.1_20210110) |
T:ref | gcc -march=native -mtune=native -O3 -fwrapv -fPIC -fPIE -gdwarf-4 -Wall (10.2.1_20210110) |
ref | gcc -march=native -mtune=native -O -fwrapv -fPIC -fPIE -gdwarf-4 -Wall (10.2.1_20210110) |
T:ref | gcc -march=native -mtune=native -O -fwrapv -fPIC -fPIE -gdwarf-4 -Wall (10.2.1_20210110) |
ref | gcc -march=native -mtune=native -Os -fwrapv -fPIC -fPIE -gdwarf-4 -Wall (10.2.1_20210110) |
T:ref | gcc -march=native -mtune=native -Os -fwrapv -fPIC -fPIE -gdwarf-4 -Wall (10.2.1_20210110) |
Passed TIMECOP
TIMECOP iterations: 1
Number of similar (implementation,compiler) pairs: 10, namely:
Implementation | Compiler |
compact | clang -march=native -O2 -fwrapv -Qunused-arguments -fPIC -fPIE -gdwarf-4 -Wall (Debian_Clang_11.0.1) |
compact | clang -march=native -O3 -fwrapv -Qunused-arguments -fPIC -fPIE -gdwarf-4 -Wall (Debian_Clang_11.0.1) |
compact | clang -march=native -O -fwrapv -Qunused-arguments -fPIC -fPIE -gdwarf-4 -Wall (Debian_Clang_11.0.1) |
compact | clang -march=native -Os -fwrapv -Qunused-arguments -fPIC -fPIE -gdwarf-4 -Wall (Debian_Clang_11.0.1) |
compact | clang -mcpu=native -O3 -fwrapv -Qunused-arguments -fPIC -fPIE -gdwarf-4 -Wall (Debian_Clang_11.0.1) |
ref | clang -march=native -O2 -fwrapv -Qunused-arguments -fPIC -fPIE -gdwarf-4 -Wall (Debian_Clang_11.0.1) |
ref | clang -march=native -O3 -fwrapv -Qunused-arguments -fPIC -fPIE -gdwarf-4 -Wall (Debian_Clang_11.0.1) |
ref | clang -march=native -O -fwrapv -Qunused-arguments -fPIC -fPIE -gdwarf-4 -Wall (Debian_Clang_11.0.1) |
ref | clang -march=native -Os -fwrapv -Qunused-arguments -fPIC -fPIE -gdwarf-4 -Wall (Debian_Clang_11.0.1) |
ref | clang -mcpu=native -O3 -fwrapv -Qunused-arguments -fPIC -fPIE -gdwarf-4 -Wall (Debian_Clang_11.0.1) |