Test results for amd64, bolero, crypto_aead/ascon128av12

[Page version: 20250314 17:16:01]

Measurements for amd64, bolero, crypto_aead Test results for amd64, bolero, crypto_aead Test results for crypto_aead/ascon128av12
Computer: bolero
Microarchitecture: amd64; Broadwell+AES (406f1)
Architecture: amd64
CPU ID: GenuineIntel-000406f1-1fc9cbf5
SUPERCOP version: 20250307
Operation: crypto_aead
Primitive: ascon128av12
TimeObject sizeTest sizeImplementationCompilerBenchmark dateSUPERCOP version
4487618313 0 032902 776 928opt64gcc -march=native -mtune=native -O2 -fwrapv -fPIC -fPIE -gdwarf-4 -Wall2025030920250307
4500818365 0 031369 752 896opt64gcc -march=native -mtune=native -Os -fwrapv -fPIC -fPIE -gdwarf-4 -Wall2025030920250307
4501218465 0 035094 776 928opt64gcc -march=native -mtune=native -O3 -fwrapv -fPIC -fPIE -gdwarf-4 -Wall2025030920250307
4516816965 0 030380 816 856opt64clang -march=native -O -fwrapv -Qunused-arguments -fPIC -fPIE -gdwarf-4 -Wall2025030920250307
4538416748 0 034300 816 872opt64clang -march=native -O3 -fwrapv -Qunused-arguments -fPIC -fPIE -gdwarf-4 -Wall2025030920250307
4546416701 0 030822 808 920opt64clang -march=native -Os -fwrapv -Qunused-arguments -fPIC -fPIE -gdwarf-4 -Wall2025030920250307
4730017233 0 033156 816 856opt64clang -mcpu=native -O3 -fwrapv -Qunused-arguments -fPIC -fPIE -gdwarf-4 -Wall2025030920250307
4824417079 0 033758 776 928refgcc -march=native -mtune=native -O3 -fwrapv -fPIC -fPIE -gdwarf-4 -Wall2025030920250307
5196414816 0 031700 816 872refclang -march=native -O2 -fwrapv -Qunused-arguments -fPIC -fPIE -gdwarf-4 -Wall2025030920250307
5198014816 0 032012 816 872refclang -march=native -O3 -fwrapv -Qunused-arguments -fPIC -fPIE -gdwarf-4 -Wall2025030920250307
5233621854 0 036061 768 928opt64gcc -march=native -mtune=native -O -fwrapv -fPIC -fPIE -gdwarf-4 -Wall2025030920250307
528401538 0 018780 816 872opt64_lowsizeclang -march=native -O2 -fwrapv -Qunused-arguments -fPIC -fPIE -gdwarf-4 -Wall2025030920250307
529801433 0 014828 816 856opt64_lowsizeclang -march=native -O -fwrapv -Qunused-arguments -fPIC -fPIE -gdwarf-4 -Wall2025030920250307
530721768 0 019316 816 872opt64_lowsizeclang -march=native -O3 -fwrapv -Qunused-arguments -fPIC -fPIE -gdwarf-4 -Wall2025030920250307
530967865 0 023804 816 856refclang -mcpu=native -O3 -fwrapv -Qunused-arguments -fPIC -fPIE -gdwarf-4 -Wall2025030920250307
542322368 0 019053 784 928opt64_lowsizegcc -march=native -mtune=native -O3 -fwrapv -fPIC -fPIE -gdwarf-4 -Wall2025030920250307
5506820791 0 038340 816 872opt32clang -march=native -O3 -fwrapv -Qunused-arguments -fPIC -fPIE -gdwarf-4 -Wall2025030920250307
5514020736 0 034846 808 920opt32clang -march=native -Os -fwrapv -Qunused-arguments -fPIC -fPIE -gdwarf-4 -Wall2025030920250307
5526820782 0 038028 816 872opt32clang -march=native -O2 -fwrapv -Qunused-arguments -fPIC -fPIE -gdwarf-4 -Wall2025030920250307
5583221285 0 034700 816 856opt32clang -march=native -O -fwrapv -Qunused-arguments -fPIC -fPIE -gdwarf-4 -Wall2025030920250307
5603610393 0 024286 808 920refclang -march=native -Os -fwrapv -Qunused-arguments -fPIC -fPIE -gdwarf-4 -Wall2025030920250307
562681826 0 014784 760 896opt64_lowsizegcc -march=native -mtune=native -Os -fwrapv -fPIC -fPIE -gdwarf-4 -Wall2025030920250307
5674421776 0 036358 776 928opt32gcc -march=native -mtune=native -O2 -fwrapv -fPIC -fPIE -gdwarf-4 -Wall2025030920250307
5677621768 0 038390 776 928opt32gcc -march=native -mtune=native -O3 -fwrapv -fPIC -fPIE -gdwarf-4 -Wall2025030920250307
571321770 0 017684 816 856opt64_lowsizeclang -mcpu=native -O3 -fwrapv -Qunused-arguments -fPIC -fPIE -gdwarf-4 -Wall2025030920250307
5858412700 0 026949 768 928refgcc -march=native -mtune=native -O -fwrapv -fPIC -fPIE -gdwarf-4 -Wall2025030920250307
585961524 0 015614 808 920opt64_lowsizeclang -march=native -Os -fwrapv -Qunused-arguments -fPIC -fPIE -gdwarf-4 -Wall2025030920250307
5995612683 0 027310 776 928refgcc -march=native -mtune=native -O2 -fwrapv -fPIC -fPIE -gdwarf-4 -Wall2025030920250307
622326920 0 020356 816 856refclang -march=native -O -fwrapv -Qunused-arguments -fPIC -fPIE -gdwarf-4 -Wall2025030920250307
6272022617 0 038548 816 856opt32clang -mcpu=native -O3 -fwrapv -Qunused-arguments -fPIC -fPIE -gdwarf-4 -Wall2025030920250307
640523076 0 017300 776 928opt64_lowsizegcc -march=native -mtune=native -O -fwrapv -fPIC -fPIE -gdwarf-4 -Wall2025030920250307
662161479 0 014876 816 856opt32_lowsizeclang -march=native -O -fwrapv -Qunused-arguments -fPIC -fPIE -gdwarf-4 -Wall2025030920250307
662602055 0 016669 784 928opt32_lowsizegcc -march=native -mtune=native -O2 -fwrapv -fPIC -fPIE -gdwarf-4 -Wall2025030920250307
6626616748 0 033988 816 872opt64clang -march=native -O2 -fwrapv -Qunused-arguments -fPIC -fPIE -gdwarf-4 -Wall2025030920250307
6744825931 0 040141 768 928opt32gcc -march=native -mtune=native -O -fwrapv -fPIC -fPIE -gdwarf-4 -Wall2025030920250307
675601878 0 014840 760 896opt32_lowsizegcc -march=native -mtune=native -Os -fwrapv -fPIC -fPIE -gdwarf-4 -Wall2025030920250307
714841810 0 017724 816 856opt32_lowsizeclang -mcpu=native -O3 -fwrapv -Qunused-arguments -fPIC -fPIE -gdwarf-4 -Wall2025030920250307
752321995 0 016613 784 928opt64_lowsizegcc -march=native -mtune=native -O2 -fwrapv -fPIC -fPIE -gdwarf-4 -Wall2025030920250307
778803138 0 017356 776 928opt32_lowsizegcc -march=native -mtune=native -O -fwrapv -fPIC -fPIE -gdwarf-4 -Wall2025030920250307
8098321527 0 034521 752 896opt32gcc -march=native -mtune=native -Os -fwrapv -fPIC -fPIE -gdwarf-4 -Wall2025030920250307
847442659 0 015705 752 896refgcc -march=native -mtune=native -Os -fwrapv -fPIC -fPIE -gdwarf-4 -Wall2025030920250307
924242397 0 019077 784 928opt32_lowsizegcc -march=native -mtune=native -O3 -fwrapv -fPIC -fPIE -gdwarf-4 -Wall2025030920250307
12056015409 0 029478 808 920bi32clang -march=native -Os -fwrapv -Qunused-arguments -fPIC -fPIE -gdwarf-4 -Wall2025030920250307
12099215432 0 032940 816 872bi32clang -march=native -O3 -fwrapv -Qunused-arguments -fPIC -fPIE -gdwarf-4 -Wall2025030920250307
12133615432 0 032628 816 872bi32clang -march=native -O2 -fwrapv -Qunused-arguments -fPIC -fPIE -gdwarf-4 -Wall2025030920250307
1224882026 0 019564 816 872opt32_lowsizeclang -march=native -O3 -fwrapv -Qunused-arguments -fPIC -fPIE -gdwarf-4 -Wall2025030920250307
1242561796 0 019028 816 872opt32_lowsizeclang -march=native -O2 -fwrapv -Qunused-arguments -fPIC -fPIE -gdwarf-4 -Wall2025030920250307
1244761778 0 015862 808 920opt32_lowsizeclang -march=native -Os -fwrapv -Qunused-arguments -fPIC -fPIE -gdwarf-4 -Wall2025030920250307
12617616067 0 031988 816 856bi32clang -mcpu=native -O3 -fwrapv -Qunused-arguments -fPIC -fPIE -gdwarf-4 -Wall2025030920250307
12810817092 0 029993 752 896bi32gcc -march=native -mtune=native -Os -fwrapv -fPIC -fPIE -gdwarf-4 -Wall2025030920250307
13288010328 0 027940 816 872bi32_lowregclang -march=native -O3 -fwrapv -Qunused-arguments -fPIC -fPIE -gdwarf-4 -Wall2025030920250307
13469620539 0 034653 768 928bi32gcc -march=native -mtune=native -O -fwrapv -fPIC -fPIE -gdwarf-4 -Wall2025030920250307
13573610328 0 027628 816 872bi32_lowregclang -march=native -O2 -fwrapv -Qunused-arguments -fPIC -fPIE -gdwarf-4 -Wall2025030920250307
13665619200 0 035750 776 928bi32gcc -march=native -mtune=native -O3 -fwrapv -fPIC -fPIE -gdwarf-4 -Wall2025030920250307
13683211392 0 026006 776 928bi32_lowreggcc -march=native -mtune=native -O2 -fwrapv -fPIC -fPIE -gdwarf-4 -Wall2025030920250307
1371362638 0 020156 816 872bi32_lowsizeclang -march=native -O3 -fwrapv -Qunused-arguments -fPIC -fPIE -gdwarf-4 -Wall2025030920250307
1382522353 0 016422 808 920bi32_lowsizeclang -march=native -Os -fwrapv -Qunused-arguments -fPIC -fPIE -gdwarf-4 -Wall2025030920250307
1413482881 0 017437 784 928bi32_lowsizegcc -march=native -mtune=native -O2 -fwrapv -fPIC -fPIE -gdwarf-4 -Wall2025030920250307
1475882648 0 018548 816 856bi32_lowsizeclang -mcpu=native -O3 -fwrapv -Qunused-arguments -fPIC -fPIE -gdwarf-4 -Wall2025030920250307
1495162322 0 015708 816 856bi32_lowsizeclang -march=native -O -fwrapv -Qunused-arguments -fPIC -fPIE -gdwarf-4 -Wall2025030920250307
15026011744 0 028398 776 928bi32_lowreggcc -march=native -mtune=native -O3 -fwrapv -fPIC -fPIE -gdwarf-4 -Wall2025030920250307
15156411376 0 024353 752 896bi32_lowreggcc -march=native -mtune=native -Os -fwrapv -fPIC -fPIE -gdwarf-4 -Wall2025030920250307
1530482695 0 015600 760 896bi32_lowsizegcc -march=native -mtune=native -Os -fwrapv -fPIC -fPIE -gdwarf-4 -Wall2025030920250307
1532723346 0 019949 784 928bi32_lowsizegcc -march=native -mtune=native -O3 -fwrapv -fPIC -fPIE -gdwarf-4 -Wall2025030920250307
15573210678 0 024172 816 856bi32_lowregclang -march=native -O -fwrapv -Qunused-arguments -fPIC -fPIE -gdwarf-4 -Wall2025030920250307
15594013799 0 028037 768 928bi32_lowreggcc -march=native -mtune=native -O -fwrapv -fPIC -fPIE -gdwarf-4 -Wall2025030920250307
1676723046 0 017212 776 928bi32_lowsizegcc -march=native -mtune=native -O -fwrapv -fPIC -fPIE -gdwarf-4 -Wall2025030920250307
17589916217 0 029620 816 856bi32clang -march=native -O -fwrapv -Qunused-arguments -fPIC -fPIE -gdwarf-4 -Wall2025030920250307
18009817762 0 032262 776 928bi32gcc -march=native -mtune=native -O2 -fwrapv -fPIC -fPIE -gdwarf-4 -Wall2025030920250307
18880210289 0 024470 808 920bi32_lowregclang -march=native -Os -fwrapv -Qunused-arguments -fPIC -fPIE -gdwarf-4 -Wall2025030920250307
19734810584 0 026572 816 856bi32_lowregclang -mcpu=native -O3 -fwrapv -Qunused-arguments -fPIC -fPIE -gdwarf-4 -Wall2025030920250307
2030142381 0 019588 816 872bi32_lowsizeclang -march=native -O2 -fwrapv -Qunused-arguments -fPIC -fPIE -gdwarf-4 -Wall2025030920250307
4074366758 0 024028 816 872opt8_lowsizeclang -march=native -O2 -fwrapv -Qunused-arguments -fPIC -fPIE -gdwarf-4 -Wall2025030920250307
4154246908 0 024100 816 872opt8clang -march=native -O2 -fwrapv -Qunused-arguments -fPIC -fPIE -gdwarf-4 -Wall2025030920250307
4492283911 0 018070 808 920opt8clang -march=native -Os -fwrapv -Qunused-arguments -fPIC -fPIE -gdwarf-4 -Wall2025030920250307
4549203830 0 017950 808 920opt8_lowsizeclang -march=native -Os -fwrapv -Qunused-arguments -fPIC -fPIE -gdwarf-4 -Wall2025030920250307
4695049755 0 025300 816 856bi8clang -mcpu=native -O3 -fwrapv -Qunused-arguments -fPIC -fPIE -gdwarf-4 -Wall2025030920250307
5116769565 0 026740 816 872bi8clang -march=native -O3 -fwrapv -Qunused-arguments -fPIC -fPIE -gdwarf-4 -Wall2025030920250307
5179129565 0 026428 816 872bi8clang -march=native -O2 -fwrapv -Qunused-arguments -fPIC -fPIE -gdwarf-4 -Wall2025030920250307
5335489683 0 023422 808 920bi8clang -march=native -Os -fwrapv -Qunused-arguments -fPIC -fPIE -gdwarf-4 -Wall2025030920250307
5609169530 0 025678 776 928bi8gcc -march=native -mtune=native -O3 -fwrapv -fPIC -fPIE -gdwarf-4 -Wall2025030920250307
5920407125 0 023084 816 856opt8clang -mcpu=native -O3 -fwrapv -Qunused-arguments -fPIC -fPIE -gdwarf-4 -Wall2025030920250307
5953327099 0 023028 816 856opt8_lowsizeclang -mcpu=native -O3 -fwrapv -Qunused-arguments -fPIC -fPIE -gdwarf-4 -Wall2025030920250307
61120814225 0 027981 768 928bi8gcc -march=native -mtune=native -O -fwrapv -fPIC -fPIE -gdwarf-4 -Wall2025030920250307
62163210734 0 023257 752 896bi8gcc -march=native -mtune=native -Os -fwrapv -fPIC -fPIE -gdwarf-4 -Wall2025030920250307
6392764172 0 017604 816 856opt8_lowsizeclang -march=native -O -fwrapv -Qunused-arguments -fPIC -fPIE -gdwarf-4 -Wall2025030920250307
6414684240 0 017700 816 856opt8clang -march=native -O -fwrapv -Qunused-arguments -fPIC -fPIE -gdwarf-4 -Wall2025030920250307
7506309754 0 022796 816 856bi8clang -march=native -O -fwrapv -Qunused-arguments -fPIC -fPIE -gdwarf-4 -Wall2025030920250307
7609767803 0 025364 816 872opt8_lowsizeclang -march=native -O3 -fwrapv -Qunused-arguments -fPIC -fPIE -gdwarf-4 -Wall2025030920250307
88774010821 0 024950 776 928bi8gcc -march=native -mtune=native -O2 -fwrapv -fPIC -fPIE -gdwarf-4 -Wall2025030920250307
10162805582 0 019821 768 928opt8gcc -march=native -mtune=native -O -fwrapv -fPIC -fPIE -gdwarf-4 -Wall2025030920250307
10181725455 0 019653 768 928opt8_lowsizegcc -march=native -mtune=native -O -fwrapv -fPIC -fPIE -gdwarf-4 -Wall2025030920250307
10209045890 0 020518 776 928opt8gcc -march=native -mtune=native -O2 -fwrapv -fPIC -fPIE -gdwarf-4 -Wall2025030920250307
10353925680 0 020278 776 928opt8_lowsizegcc -march=native -mtune=native -O2 -fwrapv -fPIC -fPIE -gdwarf-4 -Wall2025030920250307
10466727834 0 024518 776 928opt8gcc -march=native -mtune=native -O3 -fwrapv -fPIC -fPIE -gdwarf-4 -Wall2025030920250307
10544527813 0 024462 776 928opt8_lowsizegcc -march=native -mtune=native -O3 -fwrapv -fPIC -fPIE -gdwarf-4 -Wall2025030920250307
10772127921 0 025436 816 872opt8clang -march=native -O3 -fwrapv -Qunused-arguments -fPIC -fPIE -gdwarf-4 -Wall2025030920250307
11870165314 0 018329 752 896opt8gcc -march=native -mtune=native -Os -fwrapv -fPIC -fPIE -gdwarf-4 -Wall2025030920250307
11933365144 0 018089 752 896opt8_lowsizegcc -march=native -mtune=native -Os -fwrapv -fPIC -fPIE -gdwarf-4 -Wall2025030920250307

Compiler output


ascon.S: ascon.S:159:5: error: ambiguous instructions require an explicit suffix (could be 'jb', or 'jl')
ascon.S:     j .LPloopcond
ascon.S:     ^
ascon.S: ascon.S:162:5: error: unknown use of instruction mnemonic without a size suffix
ascon.S:     xor s5, s5, t2
ascon.S:     ^
ascon.S: ascon.S:163:15: error: expected register here
ascon.S:     lbu t2, 1(t1)
ascon.S:               ^
ascon.S: ascon.S:164:5: error: unknown use of instruction mnemonic without a size suffix
ascon.S:     xor s4, s4, t2
ascon.S:     ^
ascon.S: <instantiation>:1:1: error: unknown use of instruction mnemonic without a size suffix
ascon.S: xor t3, s1, s9
ascon.S: ^
ascon.S: ascon.S:167:5: note: while in macro instantiation
ascon.S:     sbox s1, s3, s5, s7, s9, t4, t3, t5
ascon.S:     ^
ascon.S: <instantiation>:2:5: error: unknown use of instruction mnemonic without a size suffix
ascon.S:     xor t5, s7, s9
ascon.S:     ^
ascon.S: ascon.S:167:5: note: while in macro instantiation
ascon.S:     sbox s1, s3, s5, s7, s9, t4, t3, t5
ascon.S:     ^
ascon.S: <instantiation>:3:5: error: unknown use of instruction mnemonic without a size suffix
ascon.S: ...

Number of similar (implementation,compiler) pairs: 5, namely:
ImplementationCompiler
T:asm_bi32_rv32bclang -march=native -O2 -fwrapv -Qunused-arguments -fPIC -fPIE -gdwarf-4 -Wall (Ubuntu_Clang_14.0.0)
T:asm_bi32_rv32bclang -march=native -O3 -fwrapv -Qunused-arguments -fPIC -fPIE -gdwarf-4 -Wall (Ubuntu_Clang_14.0.0)
T:asm_bi32_rv32bclang -march=native -O -fwrapv -Qunused-arguments -fPIC -fPIE -gdwarf-4 -Wall (Ubuntu_Clang_14.0.0)
T:asm_bi32_rv32bclang -march=native -Os -fwrapv -Qunused-arguments -fPIC -fPIE -gdwarf-4 -Wall (Ubuntu_Clang_14.0.0)
T:asm_bi32_rv32bclang -mcpu=native -O3 -fwrapv -Qunused-arguments -fPIC -fPIE -gdwarf-4 -Wall (Ubuntu_Clang_14.0.0)

Compiler output


ascon.S: ascon.S: Assembler messages:
ascon.S: ascon.S:159: Error: no such instruction: `j .LPloopcond'
ascon.S: ascon.S:162: Error: too many memory references for `xor'
ascon.S: ascon.S:163: Error: no such instruction: `lbu t2,1(t1)'
ascon.S: ascon.S:164: Error: too many memory references for `xor'
ascon.S: ascon.S:167: Error: too many memory references for `xor'
ascon.S: ascon.S:167: Error: too many memory references for `xor'
ascon.S: ascon.S:167: Error: too many memory references for `xor'
ascon.S: ascon.S:167: Error: no such instruction: `orn s9,s7,s9'
ascon.S: ascon.S:167: Error: too many memory references for `xor'
ascon.S: ascon.S:167: Error: too many memory references for `xor'
ascon.S: ascon.S:167: Error: too many memory references for `or'
ascon.S: ascon.S:167: Error: too many memory references for `xor'
ascon.S: ascon.S:167: Error: too many memory references for `xor'
ascon.S: ascon.S:167: Error: too many memory references for `or'
ascon.S: ascon.S:167: Error: too many memory references for `xor'
ascon.S: ascon.S:167: Error: too many memory references for `or'
ascon.S: ascon.S:167: Error: too many memory references for `xor'
ascon.S: ascon.S:167: Error: too many memory references for `andn'
ascon.S: ascon.S:167: Error: too many memory references for `xor'
ascon.S: ascon.S:168: Error: too many memory references for `xor'
ascon.S: ascon.S:168: Error: too many memory references for `xor'
ascon.S: ascon.S:168: Error: too many memory references for `xor'
ascon.S: ascon.S:168: Error: no such instruction: `orn s8,s6,s8'
ascon.S: ascon.S:168: Error: too many memory references for `xor'
ascon.S: ...

Number of similar (implementation,compiler) pairs: 4, namely:
ImplementationCompiler
T:asm_bi32_rv32bgcc -march=native -mtune=native -O2 -fwrapv -fPIC -fPIE -gdwarf-4 -Wall (11.4.0)
T:asm_bi32_rv32bgcc -march=native -mtune=native -O3 -fwrapv -fPIC -fPIE -gdwarf-4 -Wall (11.4.0)
T:asm_bi32_rv32bgcc -march=native -mtune=native -O -fwrapv -fPIC -fPIE -gdwarf-4 -Wall (11.4.0)
T:asm_bi32_rv32bgcc -march=native -mtune=native -Os -fwrapv -fPIC -fPIE -gdwarf-4 -Wall (11.4.0)

Compiler output


ascon.S: ascon.S:1:10: fatal error: 'xtensa/coreasm.h' file not found
ascon.S: #include <xtensa/coreasm.h>
ascon.S:          ^~~~~~~~~~~~~~~~~~
ascon.S: 1 error generated.

Number of similar (implementation,compiler) pairs: 5, namely:
ImplementationCompiler
T:asm_esp32clang -march=native -O2 -fwrapv -Qunused-arguments -fPIC -fPIE -gdwarf-4 -Wall (Ubuntu_Clang_14.0.0)
T:asm_esp32clang -march=native -O3 -fwrapv -Qunused-arguments -fPIC -fPIE -gdwarf-4 -Wall (Ubuntu_Clang_14.0.0)
T:asm_esp32clang -march=native -O -fwrapv -Qunused-arguments -fPIC -fPIE -gdwarf-4 -Wall (Ubuntu_Clang_14.0.0)
T:asm_esp32clang -march=native -Os -fwrapv -Qunused-arguments -fPIC -fPIE -gdwarf-4 -Wall (Ubuntu_Clang_14.0.0)
T:asm_esp32clang -mcpu=native -O3 -fwrapv -Qunused-arguments -fPIC -fPIE -gdwarf-4 -Wall (Ubuntu_Clang_14.0.0)

Compiler output


ascon.S: ascon.S:1:10: fatal error: xtensa/coreasm.h: No such file or directory
ascon.S:     1 | #include <xtensa/coreasm.h>
ascon.S:       |          ^~~~~~~~~~~~~~~~~~
ascon.S: compilation terminated.

Number of similar (implementation,compiler) pairs: 4, namely:
ImplementationCompiler
T:asm_esp32gcc -march=native -mtune=native -O2 -fwrapv -fPIC -fPIE -gdwarf-4 -Wall (11.4.0)
T:asm_esp32gcc -march=native -mtune=native -O3 -fwrapv -fPIC -fPIE -gdwarf-4 -Wall (11.4.0)
T:asm_esp32gcc -march=native -mtune=native -O -fwrapv -fPIC -fPIE -gdwarf-4 -Wall (11.4.0)
T:asm_esp32gcc -march=native -mtune=native -Os -fwrapv -fPIC -fPIE -gdwarf-4 -Wall (11.4.0)

Compiler output


ascon.S: ascon.S:110:5: error: invalid instruction mnemonic 'li'
ascon.S:     li t6, 0x4b
ascon.S:     ^~
ascon.S: ascon.S:113:5: error: unknown use of instruction mnemonic without a size suffix
ascon.S:     xor s5, s5, t1
ascon.S:     ^
ascon.S: <instantiation>:1:1: error: unknown use of instruction mnemonic without a size suffix
ascon.S: xor t3, s1, s9
ascon.S: ^
ascon.S: ascon.S:116:5: note: while in macro instantiation
ascon.S:     sbox s1, s3, s5, s7, s9, t4, t3, t5
ascon.S:     ^
ascon.S: <instantiation>:2:5: error: unknown use of instruction mnemonic without a size suffix
ascon.S:     xor t5, s7, s9
ascon.S:     ^
ascon.S: ascon.S:116:5: note: while in macro instantiation
ascon.S:     sbox s1, s3, s5, s7, s9, t4, t3, t5
ascon.S:     ^
ascon.S: <instantiation>:3:5: error: unknown use of instruction mnemonic without a size suffix
ascon.S:     xor t4, s3, s5
ascon.S:     ^
ascon.S: ascon.S:116:5: note: while in macro instantiation
ascon.S:     sbox s1, s3, s5, s7, s9, t4, t3, t5
ascon.S:     ^
ascon.S: <instantiation>:4:5: error: invalid instruction mnemonic 'orn'
ascon.S: ...

Number of similar (implementation,compiler) pairs: 5, namely:
ImplementationCompiler
T:asm_fsr_rv32bclang -march=native -O2 -fwrapv -Qunused-arguments -fPIC -fPIE -gdwarf-4 -Wall (Ubuntu_Clang_14.0.0)
T:asm_fsr_rv32bclang -march=native -O3 -fwrapv -Qunused-arguments -fPIC -fPIE -gdwarf-4 -Wall (Ubuntu_Clang_14.0.0)
T:asm_fsr_rv32bclang -march=native -O -fwrapv -Qunused-arguments -fPIC -fPIE -gdwarf-4 -Wall (Ubuntu_Clang_14.0.0)
T:asm_fsr_rv32bclang -march=native -Os -fwrapv -Qunused-arguments -fPIC -fPIE -gdwarf-4 -Wall (Ubuntu_Clang_14.0.0)
T:asm_fsr_rv32bclang -mcpu=native -O3 -fwrapv -Qunused-arguments -fPIC -fPIE -gdwarf-4 -Wall (Ubuntu_Clang_14.0.0)

Compiler output


ascon.S: ascon.S: Assembler messages:
ascon.S: ascon.S:110: Error: no such instruction: `li t6,0x4b'
ascon.S: ascon.S:113: Error: too many memory references for `xor'
ascon.S: ascon.S:116: Error: too many memory references for `xor'
ascon.S: ascon.S:116: Error: too many memory references for `xor'
ascon.S: ascon.S:116: Error: too many memory references for `xor'
ascon.S: ascon.S:116: Error: no such instruction: `orn s9,s7,s9'
ascon.S: ascon.S:116: Error: too many memory references for `xor'
ascon.S: ascon.S:116: Error: too many memory references for `xor'
ascon.S: ascon.S:116: Error: too many memory references for `or'
ascon.S: ascon.S:116: Error: too many memory references for `xor'
ascon.S: ascon.S:116: Error: too many memory references for `xor'
ascon.S: ascon.S:116: Error: too many memory references for `or'
ascon.S: ascon.S:116: Error: too many memory references for `xor'
ascon.S: ascon.S:116: Error: too many memory references for `or'
ascon.S: ascon.S:116: Error: too many memory references for `xor'
ascon.S: ascon.S:116: Error: too many memory references for `andn'
ascon.S: ascon.S:116: Error: too many memory references for `xor'
ascon.S: ascon.S:117: Error: too many memory references for `xor'
ascon.S: ascon.S:117: Error: too many memory references for `xor'
ascon.S: ascon.S:117: Error: too many memory references for `xor'
ascon.S: ascon.S:117: Error: no such instruction: `orn s8,s6,s8'
ascon.S: ascon.S:117: Error: too many memory references for `xor'
ascon.S: ascon.S:117: Error: too many memory references for `xor'
ascon.S: ascon.S:117: Error: too many memory references for `or'
ascon.S: ...

Number of similar (implementation,compiler) pairs: 4, namely:
ImplementationCompiler
T:asm_fsr_rv32bgcc -march=native -mtune=native -O2 -fwrapv -fPIC -fPIE -gdwarf-4 -Wall (11.4.0)
T:asm_fsr_rv32bgcc -march=native -mtune=native -O3 -fwrapv -fPIC -fPIE -gdwarf-4 -Wall (11.4.0)
T:asm_fsr_rv32bgcc -march=native -mtune=native -O -fwrapv -fPIC -fPIE -gdwarf-4 -Wall (11.4.0)
T:asm_fsr_rv32bgcc -march=native -mtune=native -Os -fwrapv -fPIC -fPIE -gdwarf-4 -Wall (11.4.0)

Compiler output


ascon.S: ascon.S:118:5: error: invalid instruction mnemonic 'li'
ascon.S:     li t6, 0x4b
ascon.S:     ^~
ascon.S: ascon.S:121:5: error: unknown use of instruction mnemonic without a size suffix
ascon.S:     xor s5, s5, t1
ascon.S:     ^
ascon.S: <instantiation>:1:1: error: unknown use of instruction mnemonic without a size suffix
ascon.S: xor t3, s1, s9
ascon.S: ^
ascon.S: ascon.S:124:5: note: while in macro instantiation
ascon.S:     sbox s1, s3, s5, s7, s9, t4, t3, t5
ascon.S:     ^
ascon.S: <instantiation>:2:5: error: unknown use of instruction mnemonic without a size suffix
ascon.S:     xor t5, s7, s9
ascon.S:     ^
ascon.S: ascon.S:124:5: note: while in macro instantiation
ascon.S:     sbox s1, s3, s5, s7, s9, t4, t3, t5
ascon.S:     ^
ascon.S: <instantiation>:3:5: error: unknown use of instruction mnemonic without a size suffix
ascon.S:     xor t4, s3, s5
ascon.S:     ^
ascon.S: ascon.S:124:5: note: while in macro instantiation
ascon.S:     sbox s1, s3, s5, s7, s9, t4, t3, t5
ascon.S:     ^
ascon.S: <instantiation>:4:5: error: invalid instruction mnemonic 'orn'
ascon.S: ...

Number of similar (implementation,compiler) pairs: 5, namely:
ImplementationCompiler
T:asm_rv32bclang -march=native -O2 -fwrapv -Qunused-arguments -fPIC -fPIE -gdwarf-4 -Wall (Ubuntu_Clang_14.0.0)
T:asm_rv32bclang -march=native -O3 -fwrapv -Qunused-arguments -fPIC -fPIE -gdwarf-4 -Wall (Ubuntu_Clang_14.0.0)
T:asm_rv32bclang -march=native -O -fwrapv -Qunused-arguments -fPIC -fPIE -gdwarf-4 -Wall (Ubuntu_Clang_14.0.0)
T:asm_rv32bclang -march=native -Os -fwrapv -Qunused-arguments -fPIC -fPIE -gdwarf-4 -Wall (Ubuntu_Clang_14.0.0)
T:asm_rv32bclang -mcpu=native -O3 -fwrapv -Qunused-arguments -fPIC -fPIE -gdwarf-4 -Wall (Ubuntu_Clang_14.0.0)

Compiler output


ascon.S: ascon.S: Assembler messages:
ascon.S: ascon.S:118: Error: no such instruction: `li t6,0x4b'
ascon.S: ascon.S:121: Error: too many memory references for `xor'
ascon.S: ascon.S:124: Error: too many memory references for `xor'
ascon.S: ascon.S:124: Error: too many memory references for `xor'
ascon.S: ascon.S:124: Error: too many memory references for `xor'
ascon.S: ascon.S:124: Error: no such instruction: `orn s9,s7,s9'
ascon.S: ascon.S:124: Error: too many memory references for `xor'
ascon.S: ascon.S:124: Error: too many memory references for `xor'
ascon.S: ascon.S:124: Error: too many memory references for `or'
ascon.S: ascon.S:124: Error: too many memory references for `xor'
ascon.S: ascon.S:124: Error: too many memory references for `xor'
ascon.S: ascon.S:124: Error: too many memory references for `or'
ascon.S: ascon.S:124: Error: too many memory references for `xor'
ascon.S: ascon.S:124: Error: too many memory references for `or'
ascon.S: ascon.S:124: Error: too many memory references for `xor'
ascon.S: ascon.S:124: Error: too many memory references for `andn'
ascon.S: ascon.S:124: Error: too many memory references for `xor'
ascon.S: ascon.S:125: Error: too many memory references for `xor'
ascon.S: ascon.S:125: Error: too many memory references for `xor'
ascon.S: ascon.S:125: Error: too many memory references for `xor'
ascon.S: ascon.S:125: Error: no such instruction: `orn s8,s6,s8'
ascon.S: ascon.S:125: Error: too many memory references for `xor'
ascon.S: ascon.S:125: Error: too many memory references for `xor'
ascon.S: ascon.S:125: Error: too many memory references for `or'
ascon.S: ...

Number of similar (implementation,compiler) pairs: 4, namely:
ImplementationCompiler
T:asm_rv32bgcc -march=native -mtune=native -O2 -fwrapv -fPIC -fPIE -gdwarf-4 -Wall (11.4.0)
T:asm_rv32bgcc -march=native -mtune=native -O3 -fwrapv -fPIC -fPIE -gdwarf-4 -Wall (11.4.0)
T:asm_rv32bgcc -march=native -mtune=native -O -fwrapv -fPIC -fPIE -gdwarf-4 -Wall (11.4.0)
T:asm_rv32bgcc -march=native -mtune=native -Os -fwrapv -fPIC -fPIE -gdwarf-4 -Wall (11.4.0)

Compiler output


ascon.S: ascon.S:120:5: error: invalid instruction mnemonic 'li'
ascon.S:     li t6, 0x4b
ascon.S:     ^~
ascon.S: ascon.S:123:5: error: unknown use of instruction mnemonic without a size suffix
ascon.S:     xor s5, s5, t1
ascon.S:     ^
ascon.S: <instantiation>:1:1: error: unknown use of instruction mnemonic without a size suffix
ascon.S: xor t3, s1, s9
ascon.S: ^
ascon.S: ascon.S:126:5: note: while in macro instantiation
ascon.S:     sbox s1, s3, s5, s7, s9, t4, t3, t5
ascon.S:     ^
ascon.S: <instantiation>:2:5: error: unknown use of instruction mnemonic without a size suffix
ascon.S:     xor t5, s7, s9
ascon.S:     ^
ascon.S: ascon.S:126:5: note: while in macro instantiation
ascon.S:     sbox s1, s3, s5, s7, s9, t4, t3, t5
ascon.S:     ^
ascon.S: <instantiation>:3:5: error: invalid instruction mnemonic 'xori'
ascon.S:     xori s9, s9, -1
ascon.S:     ^~~~
ascon.S: ascon.S:126:5: note: while in macro instantiation
ascon.S:     sbox s1, s3, s5, s7, s9, t4, t3, t5
ascon.S:     ^
ascon.S: <instantiation>:4:5: error: unknown use of instruction mnemonic without a size suffix
ascon.S: ...

Number of similar (implementation,compiler) pairs: 5, namely:
ImplementationCompiler
T:asm_rv32iclang -march=native -O2 -fwrapv -Qunused-arguments -fPIC -fPIE -gdwarf-4 -Wall (Ubuntu_Clang_14.0.0)
T:asm_rv32iclang -march=native -O3 -fwrapv -Qunused-arguments -fPIC -fPIE -gdwarf-4 -Wall (Ubuntu_Clang_14.0.0)
T:asm_rv32iclang -march=native -O -fwrapv -Qunused-arguments -fPIC -fPIE -gdwarf-4 -Wall (Ubuntu_Clang_14.0.0)
T:asm_rv32iclang -march=native -Os -fwrapv -Qunused-arguments -fPIC -fPIE -gdwarf-4 -Wall (Ubuntu_Clang_14.0.0)
T:asm_rv32iclang -mcpu=native -O3 -fwrapv -Qunused-arguments -fPIC -fPIE -gdwarf-4 -Wall (Ubuntu_Clang_14.0.0)

Compiler output


ascon.S: ascon.S: Assembler messages:
ascon.S: ascon.S:120: Error: no such instruction: `li t6,0x4b'
ascon.S: ascon.S:123: Error: too many memory references for `xor'
ascon.S: ascon.S:126: Error: too many memory references for `xor'
ascon.S: ascon.S:126: Error: too many memory references for `xor'
ascon.S: ascon.S:126: Error: no such instruction: `xori s9,s9,-1'
ascon.S: ascon.S:126: Error: too many memory references for `xor'
ascon.S: ascon.S:126: Error: too many memory references for `or'
ascon.S: ascon.S:126: Error: too many memory references for `xor'
ascon.S: ascon.S:126: Error: too many memory references for `xor'
ascon.S: ascon.S:126: Error: too many memory references for `or'
ascon.S: ascon.S:126: Error: too many memory references for `xor'
ascon.S: ascon.S:126: Error: too many memory references for `xor'
ascon.S: ascon.S:126: Error: too many memory references for `or'
ascon.S: ascon.S:126: Error: too many memory references for `xor'
ascon.S: ascon.S:126: Error: too many memory references for `or'
ascon.S: ascon.S:126: Error: too many memory references for `xor'
ascon.S: ascon.S:126: Error: no such instruction: `xori t3,t3,-1'
ascon.S: ascon.S:126: Error: too many memory references for `and'
ascon.S: ascon.S:126: Error: too many memory references for `xor'
ascon.S: ascon.S:127: Error: too many memory references for `xor'
ascon.S: ascon.S:127: Error: too many memory references for `xor'
ascon.S: ascon.S:127: Error: no such instruction: `xori s8,s8,-1'
ascon.S: ascon.S:127: Error: too many memory references for `xor'
ascon.S: ascon.S:127: Error: too many memory references for `or'
ascon.S: ...

Number of similar (implementation,compiler) pairs: 4, namely:
ImplementationCompiler
T:asm_rv32igcc -march=native -mtune=native -O2 -fwrapv -fPIC -fPIE -gdwarf-4 -Wall (11.4.0)
T:asm_rv32igcc -march=native -mtune=native -O3 -fwrapv -fPIC -fPIE -gdwarf-4 -Wall (11.4.0)
T:asm_rv32igcc -march=native -mtune=native -O -fwrapv -fPIC -fPIE -gdwarf-4 -Wall (11.4.0)
T:asm_rv32igcc -march=native -mtune=native -Os -fwrapv -fPIC -fPIE -gdwarf-4 -Wall (11.4.0)

Compiler output


permutations.S: permutations.S:29:10: fatal error: 'avr/io.h' file not found
permutations.S: #include "avr/io.h"
permutations.S:          ^~~~~~~~~~
permutations.S: 1 error generated.

Number of similar (implementation,compiler) pairs: 10, namely:
ImplementationCompiler
avrclang -march=native -O2 -fwrapv -Qunused-arguments -fPIC -fPIE -gdwarf-4 -Wall (Ubuntu_Clang_14.0.0)
avrclang -march=native -O3 -fwrapv -Qunused-arguments -fPIC -fPIE -gdwarf-4 -Wall (Ubuntu_Clang_14.0.0)
avrclang -march=native -O -fwrapv -Qunused-arguments -fPIC -fPIE -gdwarf-4 -Wall (Ubuntu_Clang_14.0.0)
avrclang -march=native -Os -fwrapv -Qunused-arguments -fPIC -fPIE -gdwarf-4 -Wall (Ubuntu_Clang_14.0.0)
avrclang -mcpu=native -O3 -fwrapv -Qunused-arguments -fPIC -fPIE -gdwarf-4 -Wall (Ubuntu_Clang_14.0.0)
avr_lowsizeclang -march=native -O2 -fwrapv -Qunused-arguments -fPIC -fPIE -gdwarf-4 -Wall (Ubuntu_Clang_14.0.0)
avr_lowsizeclang -march=native -O3 -fwrapv -Qunused-arguments -fPIC -fPIE -gdwarf-4 -Wall (Ubuntu_Clang_14.0.0)
avr_lowsizeclang -march=native -O -fwrapv -Qunused-arguments -fPIC -fPIE -gdwarf-4 -Wall (Ubuntu_Clang_14.0.0)
avr_lowsizeclang -march=native -Os -fwrapv -Qunused-arguments -fPIC -fPIE -gdwarf-4 -Wall (Ubuntu_Clang_14.0.0)
avr_lowsizeclang -mcpu=native -O3 -fwrapv -Qunused-arguments -fPIC -fPIE -gdwarf-4 -Wall (Ubuntu_Clang_14.0.0)

Compiler output


aead.c: In file included from round.h:8,
aead.c:                  from permutations.h:11,
aead.c:                  from aead.c:5:
aead.c: word.h:61:11: warning: 'crypto_int64_bitmod_01' is static but used in inline function 'NOTZERO' which is not static
aead.c:    61 |   return (crypto_int64_bitmod_01(((int)(result & 0xff) - 1),8)) - 1;
aead.c:       |           ^~~~~~~~~~~~~~~~~~~~~~
permutations.S: permutations.S:29:10: fatal error: avr/io.h: No such file or directory
permutations.S:    29 | #include "avr/io.h"
permutations.S:       |          ^~~~~~~~~~
permutations.S: compilation terminated.

Number of similar (implementation,compiler) pairs: 4, namely:
ImplementationCompiler
avrgcc -march=native -mtune=native -O2 -fwrapv -fPIC -fPIE -gdwarf-4 -Wall (11.4.0)
avrgcc -march=native -mtune=native -O3 -fwrapv -fPIC -fPIE -gdwarf-4 -Wall (11.4.0)
avrgcc -march=native -mtune=native -O -fwrapv -fPIC -fPIE -gdwarf-4 -Wall (11.4.0)
avrgcc -march=native -mtune=native -Os -fwrapv -fPIC -fPIE -gdwarf-4 -Wall (11.4.0)

Compiler output


aead.c: In file included from round.h:8,
aead.c:                  from permutations.h:11,
aead.c:                  from aead.c:5:
aead.c: word.h:61:11: warning: 'crypto_int64_bitmod_01' is static but used in inline function 'NOTZERO' which is not static
aead.c:    61 |   return (crypto_int64_bitmod_01(((int)(result & 0xff) - 1),8)) - 1;
aead.c:       |           ^~~~~~~~~~~~~~~~~~~~~~
update.c: In file included from round.h:8,
update.c:                  from permutations.h:11,
update.c:                  from update.c:3:
update.c: word.h:61:11: warning: 'crypto_int64_bitmod_01' is static but used in inline function 'NOTZERO' which is not static
update.c:    61 |   return (crypto_int64_bitmod_01(((int)(result & 0xff) - 1),8)) - 1;
update.c:       |           ^~~~~~~~~~~~~~~~~~~~~~
permutations.S: permutations.S:29:10: fatal error: avr/io.h: No such file or directory
permutations.S:    29 | #include "avr/io.h"
permutations.S:       |          ^~~~~~~~~~
permutations.S: compilation terminated.

Number of similar (implementation,compiler) pairs: 4, namely:
ImplementationCompiler
avr_lowsizegcc -march=native -mtune=native -O2 -fwrapv -fPIC -fPIE -gdwarf-4 -Wall (11.4.0)
avr_lowsizegcc -march=native -mtune=native -O3 -fwrapv -fPIC -fPIE -gdwarf-4 -Wall (11.4.0)
avr_lowsizegcc -march=native -mtune=native -O -fwrapv -fPIC -fPIE -gdwarf-4 -Wall (11.4.0)
avr_lowsizegcc -march=native -mtune=native -Os -fwrapv -fPIC -fPIE -gdwarf-4 -Wall (11.4.0)

Compiler output


aead.c: aead.c:59:26: error: always_inline function '_mm512_set_epi8' requires target feature 'avx512f', but would be inlined into function 'ascon_adata' that is compiled without support for 'avx512f'
aead.c:   const __m512i u64big = AVX512_SHUFFLE_U64BIG;
aead.c:                          ^
aead.c: aead.c:8:3: note: expanded from macro 'AVX512_SHUFFLE_U64BIG'
aead.c:   _mm512_set_epi8(-1, -1, -1, -1, -1, -1, -1, -1, /* word 7 */ \
aead.c:   ^
aead.c: aead.c:59:26: error: AVX vector return of type '__m512i' (vector of 8 'long long' values) without 'avx512f' enabled changes the ABI
aead.c: aead.c:8:3: note: expanded from macro 'AVX512_SHUFFLE_U64BIG'
aead.c:   _mm512_set_epi8(-1, -1, -1, -1, -1, -1, -1, -1, /* word 7 */ \
aead.c:   ^
aead.c: aead.c:66:13: error: always_inline function '_mm512_maskz_loadu_epi8' requires target feature 'avx512bw', but would be inlined into function 'ascon_adata' that is compiled without support for 'avx512bw'
aead.c:       t.z = _mm512_maskz_loadu_epi8(mask, ad);
aead.c:             ^
aead.c: aead.c:66:13: error: AVX vector return of type '__m512i' (vector of 8 'long long' values) without 'avx512f' enabled changes the ABI
aead.c: aead.c:67:13: error: always_inline function '_mm512_maskz_shuffle_epi8' requires target feature 'avx512bw', but would be inlined into function 'ascon_adata' that is compiled without support for 'avx512bw'
aead.c:       t.z = _mm512_maskz_shuffle_epi8(mask, t.z, u64big);
aead.c:             ^
aead.c: aead.c:67:13: error: AVX vector argument of type '__m512i' (vector of 8 'long long' values) without 'avx512f' enabled changes the ABI
aead.c: aead.c:68:13: error: always_inline function '_mm512_xor_epi64' requires target feature 'avx512f', but would be inlined into function 'ascon_adata' that is compiled without support for 'avx512f'
aead.c:       r.z = _mm512_xor_epi64(r.z, t.z);
aead.c:             ^
aead.c: aead.c:68:13: error: AVX vector argument of type '__m512i' (vector of 8 'long long' values) without 'avx512f' enabled changes the ABI
aead.c: 8 errors generated.

Number of similar (implementation,compiler) pairs: 5, namely:
ImplementationCompiler
avx512clang -march=native -O2 -fwrapv -Qunused-arguments -fPIC -fPIE -gdwarf-4 -Wall (Ubuntu_Clang_14.0.0)
avx512clang -march=native -O3 -fwrapv -Qunused-arguments -fPIC -fPIE -gdwarf-4 -Wall (Ubuntu_Clang_14.0.0)
avx512clang -march=native -O -fwrapv -Qunused-arguments -fPIC -fPIE -gdwarf-4 -Wall (Ubuntu_Clang_14.0.0)
avx512clang -march=native -Os -fwrapv -Qunused-arguments -fPIC -fPIE -gdwarf-4 -Wall (Ubuntu_Clang_14.0.0)
avx512clang -mcpu=native -O3 -fwrapv -Qunused-arguments -fPIC -fPIE -gdwarf-4 -Wall (Ubuntu_Clang_14.0.0)

Compiler output


aead.c: In file included from ascon.h:7,
aead.c:                  from aead.c:2:
aead.c: word.h:32:11: warning: 'crypto_int64_bitmod_01' is static but used in inline function 'NOTZERO' which is not static
aead.c:    32 |   return (crypto_int64_bitmod_01(((int)(result & 0xff) - 1),8)) - 1;
aead.c:       |           ^~~~~~~~~~~~~~~~~~~~~~
aead.c: In file included from permutations.h:11,
aead.c:                  from aead.c:4:
aead.c: round.h: In function 'ROUND':
aead.c: round.h:12:11: warning: AVX512F vector return without AVX512F enabled changes the ABI [-Wpsabi]
aead.c:    12 |   __m512i pxor1 = _mm512_set_epi64(x, x, x, 3, x, 1, x, 4);
aead.c:       |           ^~~~~
aead.c: In file included from /usr/lib/gcc/x86_64-linux-gnu/11/include/immintrin.h:49,
aead.c:                  from ascon.h:4,
aead.c:                  from aead.c:2:
aead.c: /usr/lib/gcc/x86_64-linux-gnu/11/include/avx512fintrin.h:1645:1: error: inlining failed in call to 'always_inline' '_mm512_ternarylogic_epi64': target specific option mismatch
aead.c:  1645 | _mm512_ternarylogic_epi64 (__m512i __A, __m512i __B, __m512i __C,
aead.c:       | ^~~~~~~~~~~~~~~~~~~~~~~~~
aead.c: In file included from permutations.h:11,
aead.c:                  from aead.c:4:
aead.c: round.h:34:10: note: called from here
aead.c:    34 |   s->z = _mm512_ternarylogic_epi64(t0, t1, t2, 0x96);
aead.c:       |          ^~~~~~~~~~~~~~~~~~~~~~~~~~~~~~~~~~~~~~~~~~~
aead.c: In file included from /usr/lib/gcc/x86_64-linux-gnu/11/include/immintrin.h:49,
aead.c:                  from ascon.h:4,
aead.c:                  from aead.c:2:
aead.c: ...

Number of similar (implementation,compiler) pairs: 4, namely:
ImplementationCompiler
avx512gcc -march=native -mtune=native -O2 -fwrapv -fPIC -fPIE -gdwarf-4 -Wall (11.4.0)
avx512gcc -march=native -mtune=native -O3 -fwrapv -fPIC -fPIE -gdwarf-4 -Wall (11.4.0)
avx512gcc -march=native -mtune=native -O -fwrapv -fPIC -fPIE -gdwarf-4 -Wall (11.4.0)
avx512gcc -march=native -mtune=native -Os -fwrapv -fPIC -fPIE -gdwarf-4 -Wall (11.4.0)

Compiler output


aead.c: In file included from round.h:8,
aead.c:                  from permutations.h:11,
aead.c:                  from aead.c:4:
aead.c: word.h:55:11: warning: 'crypto_int64_bitmod_01' is static but used in inline function 'NOTZERO' which is not static
aead.c:    55 |   return (crypto_int64_bitmod_01(((int)(result & 0xff) - 1),8)) - 1;
aead.c:       |           ^~~~~~~~~~~~~~~~~~~~~~
permutations.c: In file included from round.h:8,
permutations.c:                  from permutations.h:11,
permutations.c:                  from permutations.c:1:
permutations.c: word.h:55:11: warning: 'crypto_int64_bitmod_01' is static but used in inline function 'NOTZERO' which is not static
permutations.c:    55 |   return (crypto_int64_bitmod_01(((int)(result & 0xff) - 1),8)) - 1;
permutations.c:       |           ^~~~~~~~~~~~~~~~~~~~~~

Number of similar (implementation,compiler) pairs: 12, namely:
ImplementationCompiler
bi32gcc -march=native -mtune=native -O2 -fwrapv -fPIC -fPIE -gdwarf-4 -Wall (11.4.0)
bi32gcc -march=native -mtune=native -O3 -fwrapv -fPIC -fPIE -gdwarf-4 -Wall (11.4.0)
bi32gcc -march=native -mtune=native -O -fwrapv -fPIC -fPIE -gdwarf-4 -Wall (11.4.0)
bi32gcc -march=native -mtune=native -Os -fwrapv -fPIC -fPIE -gdwarf-4 -Wall (11.4.0)
bi32_lowreggcc -march=native -mtune=native -O2 -fwrapv -fPIC -fPIE -gdwarf-4 -Wall (11.4.0)
bi32_lowreggcc -march=native -mtune=native -O3 -fwrapv -fPIC -fPIE -gdwarf-4 -Wall (11.4.0)
bi32_lowreggcc -march=native -mtune=native -O -fwrapv -fPIC -fPIE -gdwarf-4 -Wall (11.4.0)
bi32_lowreggcc -march=native -mtune=native -Os -fwrapv -fPIC -fPIE -gdwarf-4 -Wall (11.4.0)
bi8gcc -march=native -mtune=native -O2 -fwrapv -fPIC -fPIE -gdwarf-4 -Wall (11.4.0)
bi8gcc -march=native -mtune=native -O3 -fwrapv -fPIC -fPIE -gdwarf-4 -Wall (11.4.0)
bi8gcc -march=native -mtune=native -O -fwrapv -fPIC -fPIE -gdwarf-4 -Wall (11.4.0)
bi8gcc -march=native -mtune=native -Os -fwrapv -fPIC -fPIE -gdwarf-4 -Wall (11.4.0)

Compiler output


aead.c: In file included from round.h:8,
aead.c:                  from permutations.h:11,
aead.c:                  from aead.c:3:
aead.c: word.h:55:11: warning: 'crypto_int64_bitmod_01' is static but used in inline function 'NOTZERO' which is not static
aead.c:    55 |   return (crypto_int64_bitmod_01(((int)(result & 0xff) - 1),8)) - 1;
aead.c:       |           ^~~~~~~~~~~~~~~~~~~~~~
crypto_aead.c: In file included from round.h:8,
crypto_aead.c:                  from permutations.h:11,
crypto_aead.c:                  from crypto_aead.c:8:
crypto_aead.c: word.h:55:11: warning: 'crypto_int64_bitmod_01' is static but used in inline function 'NOTZERO' which is not static
crypto_aead.c:    55 |   return (crypto_int64_bitmod_01(((int)(result & 0xff) - 1),8)) - 1;
crypto_aead.c:       |           ^~~~~~~~~~~~~~~~~~~~~~
permutations.c: In file included from round.h:8,
permutations.c:                  from permutations.h:11,
permutations.c:                  from permutations.c:1:
permutations.c: word.h:55:11: warning: 'crypto_int64_bitmod_01' is static but used in inline function 'NOTZERO' which is not static
permutations.c:    55 |   return (crypto_int64_bitmod_01(((int)(result & 0xff) - 1),8)) - 1;
permutations.c:       |           ^~~~~~~~~~~~~~~~~~~~~~
update.c: In file included from round.h:8,
update.c:                  from permutations.h:11,
update.c:                  from update.c:3:
update.c: word.h:55:11: warning: 'crypto_int64_bitmod_01' is static but used in inline function 'NOTZERO' which is not static
update.c:    55 |   return (crypto_int64_bitmod_01(((int)(result & 0xff) - 1),8)) - 1;
update.c:       |           ^~~~~~~~~~~~~~~~~~~~~~

Number of similar (implementation,compiler) pairs: 4, namely:
ImplementationCompiler
bi32_lowsizegcc -march=native -mtune=native -O2 -fwrapv -fPIC -fPIE -gdwarf-4 -Wall (11.4.0)
bi32_lowsizegcc -march=native -mtune=native -O3 -fwrapv -fPIC -fPIE -gdwarf-4 -Wall (11.4.0)
bi32_lowsizegcc -march=native -mtune=native -O -fwrapv -fPIC -fPIE -gdwarf-4 -Wall (11.4.0)
bi32_lowsizegcc -march=native -mtune=native -Os -fwrapv -fPIC -fPIE -gdwarf-4 -Wall (11.4.0)

Compiler output


try.c: /usr/bin/ld: /tmp/try-small-8b488e.o: in function `doit':
try.c: .../supercop-data/bolero/amd64/try/c/clang_-march=native_-O2_-fwrapv_-Qunused-arguments_-fPIC_-fPIE_-gdwarf-4_-Wall/timingleaks/crypto_aead/ascon128av12/esp32/work/./try.c:133: undefined reference to `crypto_aead_ascon128av12_esp32_timingleaks_encrypt'
try.c: /usr/bin/ld: .../supercop-data/bolero/amd64/try/c/clang_-march=native_-O2_-fwrapv_-Qunused-arguments_-fPIC_-fPIE_-gdwarf-4_-Wall/timingleaks/crypto_aead/ascon128av12/esp32/work/./try.c:135: undefined reference to `crypto_aead_ascon128av12_esp32_timingleaks_decrypt'
try.c: /usr/bin/ld: /tmp/try-small-8b488e.o: in function `test':
try.c: .../supercop-data/bolero/amd64/try/c/clang_-march=native_-O2_-fwrapv_-Qunused-arguments_-fPIC_-fPIE_-gdwarf-4_-Wall/timingleaks/crypto_aead/ascon128av12/esp32/work/./try.c:159: undefined reference to `crypto_aead_ascon128av12_esp32_timingleaks_encrypt'
try.c: /usr/bin/ld: .../supercop-data/bolero/amd64/try/c/clang_-march=native_-O2_-fwrapv_-Qunused-arguments_-fPIC_-fPIE_-gdwarf-4_-Wall/timingleaks/crypto_aead/ascon128av12/esp32/work/./try.c:189: undefined reference to `crypto_aead_ascon128av12_esp32_timingleaks_encrypt'
try.c: /usr/bin/ld: .../supercop-data/bolero/amd64/try/c/clang_-march=native_-O2_-fwrapv_-Qunused-arguments_-fPIC_-fPIE_-gdwarf-4_-Wall/timingleaks/crypto_aead/ascon128av12/esp32/work/./try.c:300: undefined reference to `crypto_aead_ascon128av12_esp32_timingleaks_decrypt'
try.c: /usr/bin/ld: .../supercop-data/bolero/amd64/try/c/clang_-march=native_-O2_-fwrapv_-Qunused-arguments_-fPIC_-fPIE_-gdwarf-4_-Wall/timingleaks/crypto_aead/ascon128av12/esp32/work/./try.c:331: undefined reference to `crypto_aead_ascon128av12_esp32_timingleaks_decrypt'
try.c: /usr/bin/ld: .../supercop-data/bolero/amd64/try/c/clang_-march=native_-O2_-fwrapv_-Qunused-arguments_-fPIC_-fPIE_-gdwarf-4_-Wall/timingleaks/crypto_aead/ascon128av12/esp32/work/./try.c:476: undefined reference to `crypto_aead_ascon128av12_esp32_timingleaks_decrypt'
try.c: /usr/bin/ld: .../supercop-data/bolero/amd64/try/c/clang_-march=native_-O2_-fwrapv_-Qunused-arguments_-fPIC_-fPIE_-gdwarf-4_-Wall/timingleaks/crypto_aead/ascon128av12/esp32/work/./try.c:480: undefined reference to `crypto_aead_ascon128av12_esp32_timingleaks_decrypt'
try.c: /usr/bin/ld: .../supercop-data/bolero/amd64/try/c/clang_-march=native_-O2_-fwrapv_-Qunused-arguments_-fPIC_-fPIE_-gdwarf-4_-Wall/timingleaks/crypto_aead/ascon128av12/esp32/work/./try.c:484: undefined reference to `crypto_aead_ascon128av12_esp32_timingleaks_decrypt'
try.c: clang: error: linker command failed with exit code 1 (use -v to see invocation)

Number of similar (implementation,compiler) pairs: 1, namely:
ImplementationCompiler
T:esp32clang -march=native -O2 -fwrapv -Qunused-arguments -fPIC -fPIE -gdwarf-4 -Wall (Ubuntu_Clang_14.0.0)

Compiler output


try.c: /usr/bin/ld: /tmp/try-small-3c512d.o: in function `doit':
try.c: .../supercop-data/bolero/amd64/try/c/clang_-march=native_-O3_-fwrapv_-Qunused-arguments_-fPIC_-fPIE_-gdwarf-4_-Wall/timingleaks/crypto_aead/ascon128av12/esp32/work/./try.c:133: undefined reference to `crypto_aead_ascon128av12_esp32_timingleaks_encrypt'
try.c: /usr/bin/ld: .../supercop-data/bolero/amd64/try/c/clang_-march=native_-O3_-fwrapv_-Qunused-arguments_-fPIC_-fPIE_-gdwarf-4_-Wall/timingleaks/crypto_aead/ascon128av12/esp32/work/./try.c:135: undefined reference to `crypto_aead_ascon128av12_esp32_timingleaks_decrypt'
try.c: /usr/bin/ld: /tmp/try-small-3c512d.o: in function `test':
try.c: .../supercop-data/bolero/amd64/try/c/clang_-march=native_-O3_-fwrapv_-Qunused-arguments_-fPIC_-fPIE_-gdwarf-4_-Wall/timingleaks/crypto_aead/ascon128av12/esp32/work/./try.c:159: undefined reference to `crypto_aead_ascon128av12_esp32_timingleaks_encrypt'
try.c: /usr/bin/ld: .../supercop-data/bolero/amd64/try/c/clang_-march=native_-O3_-fwrapv_-Qunused-arguments_-fPIC_-fPIE_-gdwarf-4_-Wall/timingleaks/crypto_aead/ascon128av12/esp32/work/./try.c:189: undefined reference to `crypto_aead_ascon128av12_esp32_timingleaks_encrypt'
try.c: /usr/bin/ld: .../supercop-data/bolero/amd64/try/c/clang_-march=native_-O3_-fwrapv_-Qunused-arguments_-fPIC_-fPIE_-gdwarf-4_-Wall/timingleaks/crypto_aead/ascon128av12/esp32/work/./try.c:300: undefined reference to `crypto_aead_ascon128av12_esp32_timingleaks_decrypt'
try.c: /usr/bin/ld: .../supercop-data/bolero/amd64/try/c/clang_-march=native_-O3_-fwrapv_-Qunused-arguments_-fPIC_-fPIE_-gdwarf-4_-Wall/timingleaks/crypto_aead/ascon128av12/esp32/work/./try.c:331: undefined reference to `crypto_aead_ascon128av12_esp32_timingleaks_decrypt'
try.c: /usr/bin/ld: .../supercop-data/bolero/amd64/try/c/clang_-march=native_-O3_-fwrapv_-Qunused-arguments_-fPIC_-fPIE_-gdwarf-4_-Wall/timingleaks/crypto_aead/ascon128av12/esp32/work/./try.c:476: undefined reference to `crypto_aead_ascon128av12_esp32_timingleaks_decrypt'
try.c: /usr/bin/ld: .../supercop-data/bolero/amd64/try/c/clang_-march=native_-O3_-fwrapv_-Qunused-arguments_-fPIC_-fPIE_-gdwarf-4_-Wall/timingleaks/crypto_aead/ascon128av12/esp32/work/./try.c:480: undefined reference to `crypto_aead_ascon128av12_esp32_timingleaks_decrypt'
try.c: /usr/bin/ld: .../supercop-data/bolero/amd64/try/c/clang_-march=native_-O3_-fwrapv_-Qunused-arguments_-fPIC_-fPIE_-gdwarf-4_-Wall/timingleaks/crypto_aead/ascon128av12/esp32/work/./try.c:484: undefined reference to `crypto_aead_ascon128av12_esp32_timingleaks_decrypt'
try.c: clang: error: linker command failed with exit code 1 (use -v to see invocation)

Number of similar (implementation,compiler) pairs: 1, namely:
ImplementationCompiler
T:esp32clang -march=native -O3 -fwrapv -Qunused-arguments -fPIC -fPIE -gdwarf-4 -Wall (Ubuntu_Clang_14.0.0)

Compiler output


try.c: /usr/bin/ld: /tmp/try-small-ee5473.o: in function `doit':
try.c: .../supercop-data/bolero/amd64/try/c/clang_-march=native_-O_-fwrapv_-Qunused-arguments_-fPIC_-fPIE_-gdwarf-4_-Wall/timingleaks/crypto_aead/ascon128av12/esp32/work/./try.c:133: undefined reference to `crypto_aead_ascon128av12_esp32_timingleaks_encrypt'
try.c: /usr/bin/ld: .../supercop-data/bolero/amd64/try/c/clang_-march=native_-O_-fwrapv_-Qunused-arguments_-fPIC_-fPIE_-gdwarf-4_-Wall/timingleaks/crypto_aead/ascon128av12/esp32/work/./try.c:135: undefined reference to `crypto_aead_ascon128av12_esp32_timingleaks_decrypt'
try.c: /usr/bin/ld: /tmp/try-small-ee5473.o: in function `test':
try.c: .../supercop-data/bolero/amd64/try/c/clang_-march=native_-O_-fwrapv_-Qunused-arguments_-fPIC_-fPIE_-gdwarf-4_-Wall/timingleaks/crypto_aead/ascon128av12/esp32/work/./try.c:159: undefined reference to `crypto_aead_ascon128av12_esp32_timingleaks_encrypt'
try.c: /usr/bin/ld: .../supercop-data/bolero/amd64/try/c/clang_-march=native_-O_-fwrapv_-Qunused-arguments_-fPIC_-fPIE_-gdwarf-4_-Wall/timingleaks/crypto_aead/ascon128av12/esp32/work/./try.c:189: undefined reference to `crypto_aead_ascon128av12_esp32_timingleaks_encrypt'
try.c: /usr/bin/ld: .../supercop-data/bolero/amd64/try/c/clang_-march=native_-O_-fwrapv_-Qunused-arguments_-fPIC_-fPIE_-gdwarf-4_-Wall/timingleaks/crypto_aead/ascon128av12/esp32/work/./try.c:300: undefined reference to `crypto_aead_ascon128av12_esp32_timingleaks_decrypt'
try.c: /usr/bin/ld: .../supercop-data/bolero/amd64/try/c/clang_-march=native_-O_-fwrapv_-Qunused-arguments_-fPIC_-fPIE_-gdwarf-4_-Wall/timingleaks/crypto_aead/ascon128av12/esp32/work/./try.c:331: undefined reference to `crypto_aead_ascon128av12_esp32_timingleaks_decrypt'
try.c: /usr/bin/ld: .../supercop-data/bolero/amd64/try/c/clang_-march=native_-O_-fwrapv_-Qunused-arguments_-fPIC_-fPIE_-gdwarf-4_-Wall/timingleaks/crypto_aead/ascon128av12/esp32/work/./try.c:476: undefined reference to `crypto_aead_ascon128av12_esp32_timingleaks_decrypt'
try.c: /usr/bin/ld: .../supercop-data/bolero/amd64/try/c/clang_-march=native_-O_-fwrapv_-Qunused-arguments_-fPIC_-fPIE_-gdwarf-4_-Wall/timingleaks/crypto_aead/ascon128av12/esp32/work/./try.c:480: undefined reference to `crypto_aead_ascon128av12_esp32_timingleaks_decrypt'
try.c: /usr/bin/ld: .../supercop-data/bolero/amd64/try/c/clang_-march=native_-O_-fwrapv_-Qunused-arguments_-fPIC_-fPIE_-gdwarf-4_-Wall/timingleaks/crypto_aead/ascon128av12/esp32/work/./try.c:484: undefined reference to `crypto_aead_ascon128av12_esp32_timingleaks_decrypt'
try.c: clang: error: linker command failed with exit code 1 (use -v to see invocation)

Number of similar (implementation,compiler) pairs: 1, namely:
ImplementationCompiler
T:esp32clang -march=native -O -fwrapv -Qunused-arguments -fPIC -fPIE -gdwarf-4 -Wall (Ubuntu_Clang_14.0.0)

Compiler output


try.c: /usr/bin/ld: /tmp/try-small-f78828.o: in function `doit':
try.c: .../supercop-data/bolero/amd64/try/c/clang_-march=native_-Os_-fwrapv_-Qunused-arguments_-fPIC_-fPIE_-gdwarf-4_-Wall/timingleaks/crypto_aead/ascon128av12/esp32/work/./try.c:133: undefined reference to `crypto_aead_ascon128av12_esp32_timingleaks_encrypt'
try.c: /usr/bin/ld: .../supercop-data/bolero/amd64/try/c/clang_-march=native_-Os_-fwrapv_-Qunused-arguments_-fPIC_-fPIE_-gdwarf-4_-Wall/timingleaks/crypto_aead/ascon128av12/esp32/work/./try.c:135: undefined reference to `crypto_aead_ascon128av12_esp32_timingleaks_decrypt'
try.c: /usr/bin/ld: /tmp/try-small-f78828.o: in function `test':
try.c: .../supercop-data/bolero/amd64/try/c/clang_-march=native_-Os_-fwrapv_-Qunused-arguments_-fPIC_-fPIE_-gdwarf-4_-Wall/timingleaks/crypto_aead/ascon128av12/esp32/work/./try.c:159: undefined reference to `crypto_aead_ascon128av12_esp32_timingleaks_encrypt'
try.c: /usr/bin/ld: .../supercop-data/bolero/amd64/try/c/clang_-march=native_-Os_-fwrapv_-Qunused-arguments_-fPIC_-fPIE_-gdwarf-4_-Wall/timingleaks/crypto_aead/ascon128av12/esp32/work/./try.c:189: undefined reference to `crypto_aead_ascon128av12_esp32_timingleaks_encrypt'
try.c: /usr/bin/ld: .../supercop-data/bolero/amd64/try/c/clang_-march=native_-Os_-fwrapv_-Qunused-arguments_-fPIC_-fPIE_-gdwarf-4_-Wall/timingleaks/crypto_aead/ascon128av12/esp32/work/./try.c:300: undefined reference to `crypto_aead_ascon128av12_esp32_timingleaks_decrypt'
try.c: /usr/bin/ld: .../supercop-data/bolero/amd64/try/c/clang_-march=native_-Os_-fwrapv_-Qunused-arguments_-fPIC_-fPIE_-gdwarf-4_-Wall/timingleaks/crypto_aead/ascon128av12/esp32/work/./try.c:331: undefined reference to `crypto_aead_ascon128av12_esp32_timingleaks_decrypt'
try.c: /usr/bin/ld: .../supercop-data/bolero/amd64/try/c/clang_-march=native_-Os_-fwrapv_-Qunused-arguments_-fPIC_-fPIE_-gdwarf-4_-Wall/timingleaks/crypto_aead/ascon128av12/esp32/work/./try.c:476: undefined reference to `crypto_aead_ascon128av12_esp32_timingleaks_decrypt'
try.c: /usr/bin/ld: .../supercop-data/bolero/amd64/try/c/clang_-march=native_-Os_-fwrapv_-Qunused-arguments_-fPIC_-fPIE_-gdwarf-4_-Wall/timingleaks/crypto_aead/ascon128av12/esp32/work/./try.c:480: undefined reference to `crypto_aead_ascon128av12_esp32_timingleaks_decrypt'
try.c: /usr/bin/ld: .../supercop-data/bolero/amd64/try/c/clang_-march=native_-Os_-fwrapv_-Qunused-arguments_-fPIC_-fPIE_-gdwarf-4_-Wall/timingleaks/crypto_aead/ascon128av12/esp32/work/./try.c:484: undefined reference to `crypto_aead_ascon128av12_esp32_timingleaks_decrypt'
try.c: clang: error: linker command failed with exit code 1 (use -v to see invocation)

Number of similar (implementation,compiler) pairs: 1, namely:
ImplementationCompiler
T:esp32clang -march=native -Os -fwrapv -Qunused-arguments -fPIC -fPIE -gdwarf-4 -Wall (Ubuntu_Clang_14.0.0)

Compiler output


try.c: /usr/bin/ld: /tmp/try-small-77bda6.o: in function `doit':
try.c: .../supercop-data/bolero/amd64/try/c/clang_-mcpu=native_-O3_-fwrapv_-Qunused-arguments_-fPIC_-fPIE_-gdwarf-4_-Wall/timingleaks/crypto_aead/ascon128av12/esp32/work/./try.c:133: undefined reference to `crypto_aead_ascon128av12_esp32_timingleaks_encrypt'
try.c: /usr/bin/ld: .../supercop-data/bolero/amd64/try/c/clang_-mcpu=native_-O3_-fwrapv_-Qunused-arguments_-fPIC_-fPIE_-gdwarf-4_-Wall/timingleaks/crypto_aead/ascon128av12/esp32/work/./try.c:135: undefined reference to `crypto_aead_ascon128av12_esp32_timingleaks_decrypt'
try.c: /usr/bin/ld: /tmp/try-small-77bda6.o: in function `test':
try.c: .../supercop-data/bolero/amd64/try/c/clang_-mcpu=native_-O3_-fwrapv_-Qunused-arguments_-fPIC_-fPIE_-gdwarf-4_-Wall/timingleaks/crypto_aead/ascon128av12/esp32/work/./try.c:159: undefined reference to `crypto_aead_ascon128av12_esp32_timingleaks_encrypt'
try.c: /usr/bin/ld: .../supercop-data/bolero/amd64/try/c/clang_-mcpu=native_-O3_-fwrapv_-Qunused-arguments_-fPIC_-fPIE_-gdwarf-4_-Wall/timingleaks/crypto_aead/ascon128av12/esp32/work/./try.c:189: undefined reference to `crypto_aead_ascon128av12_esp32_timingleaks_encrypt'
try.c: /usr/bin/ld: .../supercop-data/bolero/amd64/try/c/clang_-mcpu=native_-O3_-fwrapv_-Qunused-arguments_-fPIC_-fPIE_-gdwarf-4_-Wall/timingleaks/crypto_aead/ascon128av12/esp32/work/./try.c:300: undefined reference to `crypto_aead_ascon128av12_esp32_timingleaks_decrypt'
try.c: /usr/bin/ld: .../supercop-data/bolero/amd64/try/c/clang_-mcpu=native_-O3_-fwrapv_-Qunused-arguments_-fPIC_-fPIE_-gdwarf-4_-Wall/timingleaks/crypto_aead/ascon128av12/esp32/work/./try.c:331: undefined reference to `crypto_aead_ascon128av12_esp32_timingleaks_decrypt'
try.c: /usr/bin/ld: .../supercop-data/bolero/amd64/try/c/clang_-mcpu=native_-O3_-fwrapv_-Qunused-arguments_-fPIC_-fPIE_-gdwarf-4_-Wall/timingleaks/crypto_aead/ascon128av12/esp32/work/./try.c:476: undefined reference to `crypto_aead_ascon128av12_esp32_timingleaks_decrypt'
try.c: /usr/bin/ld: .../supercop-data/bolero/amd64/try/c/clang_-mcpu=native_-O3_-fwrapv_-Qunused-arguments_-fPIC_-fPIE_-gdwarf-4_-Wall/timingleaks/crypto_aead/ascon128av12/esp32/work/./try.c:480: undefined reference to `crypto_aead_ascon128av12_esp32_timingleaks_decrypt'
try.c: /usr/bin/ld: .../supercop-data/bolero/amd64/try/c/clang_-mcpu=native_-O3_-fwrapv_-Qunused-arguments_-fPIC_-fPIE_-gdwarf-4_-Wall/timingleaks/crypto_aead/ascon128av12/esp32/work/./try.c:484: undefined reference to `crypto_aead_ascon128av12_esp32_timingleaks_decrypt'
try.c: clang: error: linker command failed with exit code 1 (use -v to see invocation)

Number of similar (implementation,compiler) pairs: 1, namely:
ImplementationCompiler
T:esp32clang -mcpu=native -O3 -fwrapv -Qunused-arguments -fPIC -fPIE -gdwarf-4 -Wall (Ubuntu_Clang_14.0.0)

Compiler output


try.c: /usr/bin/ld: /tmp/cc9T5A2t.o: in function `doit':
try.c: .../supercop-data/bolero/amd64/try/c/gcc_-march=native_-mtune=native_-O2_-fwrapv_-fPIC_-fPIE_-gdwarf-4_-Wall/timingleaks/crypto_aead/ascon128av12/esp32/work/try.c:133: undefined reference to `crypto_aead_ascon128av12_esp32_timingleaks_encrypt'
try.c: /usr/bin/ld: .../supercop-data/bolero/amd64/try/c/gcc_-march=native_-mtune=native_-O2_-fwrapv_-fPIC_-fPIE_-gdwarf-4_-Wall/timingleaks/crypto_aead/ascon128av12/esp32/work/try.c:135: undefined reference to `crypto_aead_ascon128av12_esp32_timingleaks_decrypt'
try.c: /usr/bin/ld: /tmp/cc9T5A2t.o: in function `test':
try.c: .../supercop-data/bolero/amd64/try/c/gcc_-march=native_-mtune=native_-O2_-fwrapv_-fPIC_-fPIE_-gdwarf-4_-Wall/timingleaks/crypto_aead/ascon128av12/esp32/work/try.c:189: undefined reference to `crypto_aead_ascon128av12_esp32_timingleaks_encrypt'
try.c: /usr/bin/ld: .../supercop-data/bolero/amd64/try/c/gcc_-march=native_-mtune=native_-O2_-fwrapv_-fPIC_-fPIE_-gdwarf-4_-Wall/timingleaks/crypto_aead/ascon128av12/esp32/work/try.c:300: undefined reference to `crypto_aead_ascon128av12_esp32_timingleaks_decrypt'
try.c: /usr/bin/ld: .../supercop-data/bolero/amd64/try/c/gcc_-march=native_-mtune=native_-O2_-fwrapv_-fPIC_-fPIE_-gdwarf-4_-Wall/timingleaks/crypto_aead/ascon128av12/esp32/work/try.c:331: undefined reference to `crypto_aead_ascon128av12_esp32_timingleaks_decrypt'
try.c: /usr/bin/ld: .../supercop-data/bolero/amd64/try/c/gcc_-march=native_-mtune=native_-O2_-fwrapv_-fPIC_-fPIE_-gdwarf-4_-Wall/timingleaks/crypto_aead/ascon128av12/esp32/work/try.c:476: undefined reference to `crypto_aead_ascon128av12_esp32_timingleaks_decrypt'
try.c: /usr/bin/ld: .../supercop-data/bolero/amd64/try/c/gcc_-march=native_-mtune=native_-O2_-fwrapv_-fPIC_-fPIE_-gdwarf-4_-Wall/timingleaks/crypto_aead/ascon128av12/esp32/work/try.c:480: undefined reference to `crypto_aead_ascon128av12_esp32_timingleaks_decrypt'
try.c: /usr/bin/ld: .../supercop-data/bolero/amd64/try/c/gcc_-march=native_-mtune=native_-O2_-fwrapv_-fPIC_-fPIE_-gdwarf-4_-Wall/timingleaks/crypto_aead/ascon128av12/esp32/work/try.c:484: undefined reference to `crypto_aead_ascon128av12_esp32_timingleaks_decrypt'
try.c: /usr/bin/ld: .../supercop-data/bolero/amd64/try/c/gcc_-march=native_-mtune=native_-O2_-fwrapv_-fPIC_-fPIE_-gdwarf-4_-Wall/timingleaks/crypto_aead/ascon128av12/esp32/work/try.c:159: undefined reference to `crypto_aead_ascon128av12_esp32_timingleaks_encrypt'
try.c: collect2: error: ld returned 1 exit status

Number of similar (implementation,compiler) pairs: 1, namely:
ImplementationCompiler
T:esp32gcc -march=native -mtune=native -O2 -fwrapv -fPIC -fPIE -gdwarf-4 -Wall (11.4.0)

Compiler output


try.c: /usr/bin/ld: /tmp/cc4cFuLH.o: in function `doit':
try.c: .../supercop-data/bolero/amd64/try/c/gcc_-march=native_-mtune=native_-O3_-fwrapv_-fPIC_-fPIE_-gdwarf-4_-Wall/timingleaks/crypto_aead/ascon128av12/esp32/work/try.c:133: undefined reference to `crypto_aead_ascon128av12_esp32_timingleaks_encrypt'
try.c: /usr/bin/ld: .../supercop-data/bolero/amd64/try/c/gcc_-march=native_-mtune=native_-O3_-fwrapv_-fPIC_-fPIE_-gdwarf-4_-Wall/timingleaks/crypto_aead/ascon128av12/esp32/work/try.c:135: undefined reference to `crypto_aead_ascon128av12_esp32_timingleaks_decrypt'
try.c: /usr/bin/ld: /tmp/cc4cFuLH.o: in function `test':
try.c: .../supercop-data/bolero/amd64/try/c/gcc_-march=native_-mtune=native_-O3_-fwrapv_-fPIC_-fPIE_-gdwarf-4_-Wall/timingleaks/crypto_aead/ascon128av12/esp32/work/try.c:189: undefined reference to `crypto_aead_ascon128av12_esp32_timingleaks_encrypt'
try.c: /usr/bin/ld: .../supercop-data/bolero/amd64/try/c/gcc_-march=native_-mtune=native_-O3_-fwrapv_-fPIC_-fPIE_-gdwarf-4_-Wall/timingleaks/crypto_aead/ascon128av12/esp32/work/try.c:300: undefined reference to `crypto_aead_ascon128av12_esp32_timingleaks_decrypt'
try.c: /usr/bin/ld: .../supercop-data/bolero/amd64/try/c/gcc_-march=native_-mtune=native_-O3_-fwrapv_-fPIC_-fPIE_-gdwarf-4_-Wall/timingleaks/crypto_aead/ascon128av12/esp32/work/try.c:331: undefined reference to `crypto_aead_ascon128av12_esp32_timingleaks_decrypt'
try.c: /usr/bin/ld: .../supercop-data/bolero/amd64/try/c/gcc_-march=native_-mtune=native_-O3_-fwrapv_-fPIC_-fPIE_-gdwarf-4_-Wall/timingleaks/crypto_aead/ascon128av12/esp32/work/try.c:476: undefined reference to `crypto_aead_ascon128av12_esp32_timingleaks_decrypt'
try.c: /usr/bin/ld: .../supercop-data/bolero/amd64/try/c/gcc_-march=native_-mtune=native_-O3_-fwrapv_-fPIC_-fPIE_-gdwarf-4_-Wall/timingleaks/crypto_aead/ascon128av12/esp32/work/try.c:480: undefined reference to `crypto_aead_ascon128av12_esp32_timingleaks_decrypt'
try.c: /usr/bin/ld: .../supercop-data/bolero/amd64/try/c/gcc_-march=native_-mtune=native_-O3_-fwrapv_-fPIC_-fPIE_-gdwarf-4_-Wall/timingleaks/crypto_aead/ascon128av12/esp32/work/try.c:484: undefined reference to `crypto_aead_ascon128av12_esp32_timingleaks_decrypt'
try.c: /usr/bin/ld: .../supercop-data/bolero/amd64/try/c/gcc_-march=native_-mtune=native_-O3_-fwrapv_-fPIC_-fPIE_-gdwarf-4_-Wall/timingleaks/crypto_aead/ascon128av12/esp32/work/try.c:159: undefined reference to `crypto_aead_ascon128av12_esp32_timingleaks_encrypt'
try.c: collect2: error: ld returned 1 exit status

Number of similar (implementation,compiler) pairs: 1, namely:
ImplementationCompiler
T:esp32gcc -march=native -mtune=native -O3 -fwrapv -fPIC -fPIE -gdwarf-4 -Wall (11.4.0)

Compiler output


try.c: /usr/bin/ld: /tmp/ccoYjQVw.o: in function `doit':
try.c: .../supercop-data/bolero/amd64/try/c/gcc_-march=native_-mtune=native_-O_-fwrapv_-fPIC_-fPIE_-gdwarf-4_-Wall/timingleaks/crypto_aead/ascon128av12/esp32/work/try.c:133: undefined reference to `crypto_aead_ascon128av12_esp32_timingleaks_encrypt'
try.c: /usr/bin/ld: .../supercop-data/bolero/amd64/try/c/gcc_-march=native_-mtune=native_-O_-fwrapv_-fPIC_-fPIE_-gdwarf-4_-Wall/timingleaks/crypto_aead/ascon128av12/esp32/work/try.c:135: undefined reference to `crypto_aead_ascon128av12_esp32_timingleaks_decrypt'
try.c: /usr/bin/ld: /tmp/ccoYjQVw.o: in function `test':
try.c: .../supercop-data/bolero/amd64/try/c/gcc_-march=native_-mtune=native_-O_-fwrapv_-fPIC_-fPIE_-gdwarf-4_-Wall/timingleaks/crypto_aead/ascon128av12/esp32/work/try.c:159: undefined reference to `crypto_aead_ascon128av12_esp32_timingleaks_encrypt'
try.c: /usr/bin/ld: .../supercop-data/bolero/amd64/try/c/gcc_-march=native_-mtune=native_-O_-fwrapv_-fPIC_-fPIE_-gdwarf-4_-Wall/timingleaks/crypto_aead/ascon128av12/esp32/work/try.c:189: undefined reference to `crypto_aead_ascon128av12_esp32_timingleaks_encrypt'
try.c: /usr/bin/ld: .../supercop-data/bolero/amd64/try/c/gcc_-march=native_-mtune=native_-O_-fwrapv_-fPIC_-fPIE_-gdwarf-4_-Wall/timingleaks/crypto_aead/ascon128av12/esp32/work/try.c:300: undefined reference to `crypto_aead_ascon128av12_esp32_timingleaks_decrypt'
try.c: /usr/bin/ld: .../supercop-data/bolero/amd64/try/c/gcc_-march=native_-mtune=native_-O_-fwrapv_-fPIC_-fPIE_-gdwarf-4_-Wall/timingleaks/crypto_aead/ascon128av12/esp32/work/try.c:331: undefined reference to `crypto_aead_ascon128av12_esp32_timingleaks_decrypt'
try.c: /usr/bin/ld: .../supercop-data/bolero/amd64/try/c/gcc_-march=native_-mtune=native_-O_-fwrapv_-fPIC_-fPIE_-gdwarf-4_-Wall/timingleaks/crypto_aead/ascon128av12/esp32/work/try.c:476: undefined reference to `crypto_aead_ascon128av12_esp32_timingleaks_decrypt'
try.c: /usr/bin/ld: .../supercop-data/bolero/amd64/try/c/gcc_-march=native_-mtune=native_-O_-fwrapv_-fPIC_-fPIE_-gdwarf-4_-Wall/timingleaks/crypto_aead/ascon128av12/esp32/work/try.c:480: undefined reference to `crypto_aead_ascon128av12_esp32_timingleaks_decrypt'
try.c: /usr/bin/ld: .../supercop-data/bolero/amd64/try/c/gcc_-march=native_-mtune=native_-O_-fwrapv_-fPIC_-fPIE_-gdwarf-4_-Wall/timingleaks/crypto_aead/ascon128av12/esp32/work/try.c:484: undefined reference to `crypto_aead_ascon128av12_esp32_timingleaks_decrypt'
try.c: collect2: error: ld returned 1 exit status

Number of similar (implementation,compiler) pairs: 1, namely:
ImplementationCompiler
T:esp32gcc -march=native -mtune=native -O -fwrapv -fPIC -fPIE -gdwarf-4 -Wall (11.4.0)

Compiler output


try.c: /usr/bin/ld: /tmp/cczksdiu.o: in function `doit':
try.c: .../supercop-data/bolero/amd64/try/c/gcc_-march=native_-mtune=native_-Os_-fwrapv_-fPIC_-fPIE_-gdwarf-4_-Wall/timingleaks/crypto_aead/ascon128av12/esp32/work/try.c:133: undefined reference to `crypto_aead_ascon128av12_esp32_timingleaks_encrypt'
try.c: /usr/bin/ld: .../supercop-data/bolero/amd64/try/c/gcc_-march=native_-mtune=native_-Os_-fwrapv_-fPIC_-fPIE_-gdwarf-4_-Wall/timingleaks/crypto_aead/ascon128av12/esp32/work/try.c:135: undefined reference to `crypto_aead_ascon128av12_esp32_timingleaks_decrypt'
try.c: /usr/bin/ld: /tmp/cczksdiu.o: in function `test':
try.c: .../supercop-data/bolero/amd64/try/c/gcc_-march=native_-mtune=native_-Os_-fwrapv_-fPIC_-fPIE_-gdwarf-4_-Wall/timingleaks/crypto_aead/ascon128av12/esp32/work/try.c:159: undefined reference to `crypto_aead_ascon128av12_esp32_timingleaks_encrypt'
try.c: /usr/bin/ld: .../supercop-data/bolero/amd64/try/c/gcc_-march=native_-mtune=native_-Os_-fwrapv_-fPIC_-fPIE_-gdwarf-4_-Wall/timingleaks/crypto_aead/ascon128av12/esp32/work/try.c:189: undefined reference to `crypto_aead_ascon128av12_esp32_timingleaks_encrypt'
try.c: /usr/bin/ld: .../supercop-data/bolero/amd64/try/c/gcc_-march=native_-mtune=native_-Os_-fwrapv_-fPIC_-fPIE_-gdwarf-4_-Wall/timingleaks/crypto_aead/ascon128av12/esp32/work/try.c:300: undefined reference to `crypto_aead_ascon128av12_esp32_timingleaks_decrypt'
try.c: /usr/bin/ld: .../supercop-data/bolero/amd64/try/c/gcc_-march=native_-mtune=native_-Os_-fwrapv_-fPIC_-fPIE_-gdwarf-4_-Wall/timingleaks/crypto_aead/ascon128av12/esp32/work/try.c:331: undefined reference to `crypto_aead_ascon128av12_esp32_timingleaks_decrypt'
try.c: /usr/bin/ld: .../supercop-data/bolero/amd64/try/c/gcc_-march=native_-mtune=native_-Os_-fwrapv_-fPIC_-fPIE_-gdwarf-4_-Wall/timingleaks/crypto_aead/ascon128av12/esp32/work/try.c:476: undefined reference to `crypto_aead_ascon128av12_esp32_timingleaks_decrypt'
try.c: /usr/bin/ld: .../supercop-data/bolero/amd64/try/c/gcc_-march=native_-mtune=native_-Os_-fwrapv_-fPIC_-fPIE_-gdwarf-4_-Wall/timingleaks/crypto_aead/ascon128av12/esp32/work/try.c:480: undefined reference to `crypto_aead_ascon128av12_esp32_timingleaks_decrypt'
try.c: /usr/bin/ld: .../supercop-data/bolero/amd64/try/c/gcc_-march=native_-mtune=native_-Os_-fwrapv_-fPIC_-fPIE_-gdwarf-4_-Wall/timingleaks/crypto_aead/ascon128av12/esp32/work/try.c:484: undefined reference to `crypto_aead_ascon128av12_esp32_timingleaks_decrypt'
try.c: collect2: error: ld returned 1 exit status

Number of similar (implementation,compiler) pairs: 1, namely:
ImplementationCompiler
T:esp32gcc -march=native -mtune=native -Os -fwrapv -fPIC -fPIE -gdwarf-4 -Wall (11.4.0)

Compiler output


aead.c: In file included from round.h:8,
aead.c:                  from permutations.h:11,
aead.c:                  from aead.c:4:
aead.c: word.h:32:11: warning: 'crypto_int64_bitmod_01' is static but used in inline function 'NOTZERO' which is not static
aead.c:    32 |   return (crypto_int64_bitmod_01(((int)(result & 0xff) - 1),8)) - 1;
aead.c:       |           ^~~~~~~~~~~~~~~~~~~~~~
permutations.c: In file included from round.h:8,
permutations.c:                  from permutations.h:11,
permutations.c:                  from permutations.c:1:
permutations.c: word.h:32:11: warning: 'crypto_int64_bitmod_01' is static but used in inline function 'NOTZERO' which is not static
permutations.c:    32 |   return (crypto_int64_bitmod_01(((int)(result & 0xff) - 1),8)) - 1;
permutations.c:       |           ^~~~~~~~~~~~~~~~~~~~~~

Number of similar (implementation,compiler) pairs: 8, namely:
ImplementationCompiler
opt32gcc -march=native -mtune=native -O2 -fwrapv -fPIC -fPIE -gdwarf-4 -Wall (11.4.0)
opt32gcc -march=native -mtune=native -O3 -fwrapv -fPIC -fPIE -gdwarf-4 -Wall (11.4.0)
opt32gcc -march=native -mtune=native -O -fwrapv -fPIC -fPIE -gdwarf-4 -Wall (11.4.0)
opt32gcc -march=native -mtune=native -Os -fwrapv -fPIC -fPIE -gdwarf-4 -Wall (11.4.0)
opt64gcc -march=native -mtune=native -O2 -fwrapv -fPIC -fPIE -gdwarf-4 -Wall (11.4.0)
opt64gcc -march=native -mtune=native -O3 -fwrapv -fPIC -fPIE -gdwarf-4 -Wall (11.4.0)
opt64gcc -march=native -mtune=native -O -fwrapv -fPIC -fPIE -gdwarf-4 -Wall (11.4.0)
opt64gcc -march=native -mtune=native -Os -fwrapv -fPIC -fPIE -gdwarf-4 -Wall (11.4.0)

Compiler output


aead.c: In file included from round.h:8,
aead.c:                  from permutations.h:11,
aead.c:                  from aead.c:3:
aead.c: word.h:32:11: warning: 'crypto_int64_bitmod_01' is static but used in inline function 'NOTZERO' which is not static
aead.c:    32 |   return (crypto_int64_bitmod_01(((int)(result & 0xff) - 1),8)) - 1;
aead.c:       |           ^~~~~~~~~~~~~~~~~~~~~~
crypto_aead.c: In file included from round.h:8,
crypto_aead.c:                  from permutations.h:11,
crypto_aead.c:                  from crypto_aead.c:8:
crypto_aead.c: word.h:32:11: warning: 'crypto_int64_bitmod_01' is static but used in inline function 'NOTZERO' which is not static
crypto_aead.c:    32 |   return (crypto_int64_bitmod_01(((int)(result & 0xff) - 1),8)) - 1;
crypto_aead.c:       |           ^~~~~~~~~~~~~~~~~~~~~~
permutations.c: In file included from round.h:8,
permutations.c:                  from permutations.h:11,
permutations.c:                  from permutations.c:1:
permutations.c: word.h:32:11: warning: 'crypto_int64_bitmod_01' is static but used in inline function 'NOTZERO' which is not static
permutations.c:    32 |   return (crypto_int64_bitmod_01(((int)(result & 0xff) - 1),8)) - 1;
permutations.c:       |           ^~~~~~~~~~~~~~~~~~~~~~
update.c: In file included from round.h:8,
update.c:                  from permutations.h:11,
update.c:                  from update.c:3:
update.c: word.h:32:11: warning: 'crypto_int64_bitmod_01' is static but used in inline function 'NOTZERO' which is not static
update.c:    32 |   return (crypto_int64_bitmod_01(((int)(result & 0xff) - 1),8)) - 1;
update.c:       |           ^~~~~~~~~~~~~~~~~~~~~~

Number of similar (implementation,compiler) pairs: 8, namely:
ImplementationCompiler
opt32_lowsizegcc -march=native -mtune=native -O2 -fwrapv -fPIC -fPIE -gdwarf-4 -Wall (11.4.0)
opt32_lowsizegcc -march=native -mtune=native -O3 -fwrapv -fPIC -fPIE -gdwarf-4 -Wall (11.4.0)
opt32_lowsizegcc -march=native -mtune=native -O -fwrapv -fPIC -fPIE -gdwarf-4 -Wall (11.4.0)
opt32_lowsizegcc -march=native -mtune=native -Os -fwrapv -fPIC -fPIE -gdwarf-4 -Wall (11.4.0)
opt64_lowsizegcc -march=native -mtune=native -O2 -fwrapv -fPIC -fPIE -gdwarf-4 -Wall (11.4.0)
opt64_lowsizegcc -march=native -mtune=native -O3 -fwrapv -fPIC -fPIE -gdwarf-4 -Wall (11.4.0)
opt64_lowsizegcc -march=native -mtune=native -O -fwrapv -fPIC -fPIE -gdwarf-4 -Wall (11.4.0)
opt64_lowsizegcc -march=native -mtune=native -Os -fwrapv -fPIC -fPIE -gdwarf-4 -Wall (11.4.0)

Compiler output


aead.c: In file included from round.h:8,
aead.c:                  from permutations.h:11,
aead.c:                  from aead.c:5:
aead.c: word.h:61:11: warning: 'crypto_int64_bitmod_01' is static but used in inline function 'NOTZERO' which is not static
aead.c:    61 |   return (crypto_int64_bitmod_01(((int)(result & 0xff) - 1),8)) - 1;
aead.c:       |           ^~~~~~~~~~~~~~~~~~~~~~
permutations.c: In file included from round.h:8,
permutations.c:                  from permutations.h:11,
permutations.c:                  from permutations.c:1:
permutations.c: word.h:61:11: warning: 'crypto_int64_bitmod_01' is static but used in inline function 'NOTZERO' which is not static
permutations.c:    61 |   return (crypto_int64_bitmod_01(((int)(result & 0xff) - 1),8)) - 1;
permutations.c:       |           ^~~~~~~~~~~~~~~~~~~~~~

Number of similar (implementation,compiler) pairs: 4, namely:
ImplementationCompiler
opt8gcc -march=native -mtune=native -O2 -fwrapv -fPIC -fPIE -gdwarf-4 -Wall (11.4.0)
opt8gcc -march=native -mtune=native -O3 -fwrapv -fPIC -fPIE -gdwarf-4 -Wall (11.4.0)
opt8gcc -march=native -mtune=native -O -fwrapv -fPIC -fPIE -gdwarf-4 -Wall (11.4.0)
opt8gcc -march=native -mtune=native -Os -fwrapv -fPIC -fPIE -gdwarf-4 -Wall (11.4.0)

Compiler output


aead.c: In file included from round.h:8,
aead.c:                  from permutations.h:11,
aead.c:                  from aead.c:5:
aead.c: word.h:61:11: warning: 'crypto_int64_bitmod_01' is static but used in inline function 'NOTZERO' which is not static
aead.c:    61 |   return (crypto_int64_bitmod_01(((int)(result & 0xff) - 1),8)) - 1;
aead.c:       |           ^~~~~~~~~~~~~~~~~~~~~~
permutations.c: In file included from round.h:8,
permutations.c:                  from permutations.h:11,
permutations.c:                  from permutations.c:1:
permutations.c: word.h:61:11: warning: 'crypto_int64_bitmod_01' is static but used in inline function 'NOTZERO' which is not static
permutations.c:    61 |   return (crypto_int64_bitmod_01(((int)(result & 0xff) - 1),8)) - 1;
permutations.c:       |           ^~~~~~~~~~~~~~~~~~~~~~
update.c: In file included from round.h:8,
update.c:                  from permutations.h:11,
update.c:                  from update.c:3:
update.c: word.h:61:11: warning: 'crypto_int64_bitmod_01' is static but used in inline function 'NOTZERO' which is not static
update.c:    61 |   return (crypto_int64_bitmod_01(((int)(result & 0xff) - 1),8)) - 1;
update.c:       |           ^~~~~~~~~~~~~~~~~~~~~~

Number of similar (implementation,compiler) pairs: 4, namely:
ImplementationCompiler
opt8_lowsizegcc -march=native -mtune=native -O2 -fwrapv -fPIC -fPIE -gdwarf-4 -Wall (11.4.0)
opt8_lowsizegcc -march=native -mtune=native -O3 -fwrapv -fPIC -fPIE -gdwarf-4 -Wall (11.4.0)
opt8_lowsizegcc -march=native -mtune=native -O -fwrapv -fPIC -fPIE -gdwarf-4 -Wall (11.4.0)
opt8_lowsizegcc -march=native -mtune=native -Os -fwrapv -fPIC -fPIE -gdwarf-4 -Wall (11.4.0)

Namespace violations


constants.o constants R
interleave.o B R
permutations.o P12 T
permutations.o P8 T

Number of similar (implementation,compiler) pairs: 9, namely:
ImplementationCompiler
bi32clang -march=native -O2 -fwrapv -Qunused-arguments -fPIC -fPIE -gdwarf-4 -Wall (Ubuntu_Clang_14.0.0)
bi32clang -march=native -O3 -fwrapv -Qunused-arguments -fPIC -fPIE -gdwarf-4 -Wall (Ubuntu_Clang_14.0.0)
bi32clang -march=native -O -fwrapv -Qunused-arguments -fPIC -fPIE -gdwarf-4 -Wall (Ubuntu_Clang_14.0.0)
bi32clang -march=native -Os -fwrapv -Qunused-arguments -fPIC -fPIE -gdwarf-4 -Wall (Ubuntu_Clang_14.0.0)
bi32clang -mcpu=native -O3 -fwrapv -Qunused-arguments -fPIC -fPIE -gdwarf-4 -Wall (Ubuntu_Clang_14.0.0)
bi32gcc -march=native -mtune=native -O2 -fwrapv -fPIC -fPIE -gdwarf-4 -Wall (11.4.0)
bi32gcc -march=native -mtune=native -O3 -fwrapv -fPIC -fPIE -gdwarf-4 -Wall (11.4.0)
bi32gcc -march=native -mtune=native -O -fwrapv -fPIC -fPIE -gdwarf-4 -Wall (11.4.0)
bi32gcc -march=native -mtune=native -Os -fwrapv -fPIC -fPIE -gdwarf-4 -Wall (11.4.0)

Namespace violations


aead.o ascon_adata T
aead.o ascon_decrypt T
aead.o ascon_encrypt T
aead.o ascon_final T
aead.o ascon_initaead T
aead.o ascon_loadkey T
constants.o constants R
interleave.o B R

Number of similar (implementation,compiler) pairs: 9, namely:
ImplementationCompiler
bi32_lowregclang -march=native -O2 -fwrapv -Qunused-arguments -fPIC -fPIE -gdwarf-4 -Wall (Ubuntu_Clang_14.0.0)
bi32_lowregclang -march=native -O3 -fwrapv -Qunused-arguments -fPIC -fPIE -gdwarf-4 -Wall (Ubuntu_Clang_14.0.0)
bi32_lowregclang -march=native -O -fwrapv -Qunused-arguments -fPIC -fPIE -gdwarf-4 -Wall (Ubuntu_Clang_14.0.0)
bi32_lowregclang -march=native -Os -fwrapv -Qunused-arguments -fPIC -fPIE -gdwarf-4 -Wall (Ubuntu_Clang_14.0.0)
bi32_lowregclang -mcpu=native -O3 -fwrapv -Qunused-arguments -fPIC -fPIE -gdwarf-4 -Wall (Ubuntu_Clang_14.0.0)
bi32_lowreggcc -march=native -mtune=native -O2 -fwrapv -fPIC -fPIE -gdwarf-4 -Wall (11.4.0)
bi32_lowreggcc -march=native -mtune=native -O3 -fwrapv -fPIC -fPIE -gdwarf-4 -Wall (11.4.0)
bi32_lowreggcc -march=native -mtune=native -O -fwrapv -fPIC -fPIE -gdwarf-4 -Wall (11.4.0)
bi32_lowreggcc -march=native -mtune=native -Os -fwrapv -fPIC -fPIE -gdwarf-4 -Wall (11.4.0)

Namespace violations


aead.o ascon_aead T
constants.o constants R
interleave.o B R
interleave.o FROMBI T
interleave.o TOBI T
permutations.o P T
update.o ascon_update T

Number of similar (implementation,compiler) pairs: 9, namely:
ImplementationCompiler
bi32_lowsizeclang -march=native -O2 -fwrapv -Qunused-arguments -fPIC -fPIE -gdwarf-4 -Wall (Ubuntu_Clang_14.0.0)
bi32_lowsizeclang -march=native -O3 -fwrapv -Qunused-arguments -fPIC -fPIE -gdwarf-4 -Wall (Ubuntu_Clang_14.0.0)
bi32_lowsizeclang -march=native -O -fwrapv -Qunused-arguments -fPIC -fPIE -gdwarf-4 -Wall (Ubuntu_Clang_14.0.0)
bi32_lowsizeclang -march=native -Os -fwrapv -Qunused-arguments -fPIC -fPIE -gdwarf-4 -Wall (Ubuntu_Clang_14.0.0)
bi32_lowsizeclang -mcpu=native -O3 -fwrapv -Qunused-arguments -fPIC -fPIE -gdwarf-4 -Wall (Ubuntu_Clang_14.0.0)
bi32_lowsizegcc -march=native -mtune=native -O2 -fwrapv -fPIC -fPIE -gdwarf-4 -Wall (11.4.0)
bi32_lowsizegcc -march=native -mtune=native -O3 -fwrapv -fPIC -fPIE -gdwarf-4 -Wall (11.4.0)
bi32_lowsizegcc -march=native -mtune=native -O -fwrapv -fPIC -fPIE -gdwarf-4 -Wall (11.4.0)
bi32_lowsizegcc -march=native -mtune=native -Os -fwrapv -fPIC -fPIE -gdwarf-4 -Wall (11.4.0)

Namespace violations


constants.o constants R
interleave.o FROMBI T
interleave.o TOBI T
permutations.o P T

Number of similar (implementation,compiler) pairs: 9, namely:
ImplementationCompiler
bi8clang -march=native -O2 -fwrapv -Qunused-arguments -fPIC -fPIE -gdwarf-4 -Wall (Ubuntu_Clang_14.0.0)
bi8clang -march=native -O3 -fwrapv -Qunused-arguments -fPIC -fPIE -gdwarf-4 -Wall (Ubuntu_Clang_14.0.0)
bi8clang -march=native -O -fwrapv -Qunused-arguments -fPIC -fPIE -gdwarf-4 -Wall (Ubuntu_Clang_14.0.0)
bi8clang -march=native -Os -fwrapv -Qunused-arguments -fPIC -fPIE -gdwarf-4 -Wall (Ubuntu_Clang_14.0.0)
bi8clang -mcpu=native -O3 -fwrapv -Qunused-arguments -fPIC -fPIE -gdwarf-4 -Wall (Ubuntu_Clang_14.0.0)
bi8gcc -march=native -mtune=native -O2 -fwrapv -fPIC -fPIE -gdwarf-4 -Wall (11.4.0)
bi8gcc -march=native -mtune=native -O3 -fwrapv -fPIC -fPIE -gdwarf-4 -Wall (11.4.0)
bi8gcc -march=native -mtune=native -O -fwrapv -fPIC -fPIE -gdwarf-4 -Wall (11.4.0)
bi8gcc -march=native -mtune=native -Os -fwrapv -fPIC -fPIE -gdwarf-4 -Wall (11.4.0)

Namespace violations


aead.o ascon_aead T
permutations.o P T
update.o ascon_update T

Number of similar (implementation,compiler) pairs: 18, namely:
ImplementationCompiler
opt32_lowsizeclang -march=native -O2 -fwrapv -Qunused-arguments -fPIC -fPIE -gdwarf-4 -Wall (Ubuntu_Clang_14.0.0)
opt32_lowsizeclang -march=native -O3 -fwrapv -Qunused-arguments -fPIC -fPIE -gdwarf-4 -Wall (Ubuntu_Clang_14.0.0)
opt32_lowsizeclang -march=native -O -fwrapv -Qunused-arguments -fPIC -fPIE -gdwarf-4 -Wall (Ubuntu_Clang_14.0.0)
opt32_lowsizeclang -march=native -Os -fwrapv -Qunused-arguments -fPIC -fPIE -gdwarf-4 -Wall (Ubuntu_Clang_14.0.0)
opt32_lowsizeclang -mcpu=native -O3 -fwrapv -Qunused-arguments -fPIC -fPIE -gdwarf-4 -Wall (Ubuntu_Clang_14.0.0)
opt32_lowsizegcc -march=native -mtune=native -O2 -fwrapv -fPIC -fPIE -gdwarf-4 -Wall (11.4.0)
opt32_lowsizegcc -march=native -mtune=native -O3 -fwrapv -fPIC -fPIE -gdwarf-4 -Wall (11.4.0)
opt32_lowsizegcc -march=native -mtune=native -O -fwrapv -fPIC -fPIE -gdwarf-4 -Wall (11.4.0)
opt32_lowsizegcc -march=native -mtune=native -Os -fwrapv -fPIC -fPIE -gdwarf-4 -Wall (11.4.0)
opt64_lowsizeclang -march=native -O2 -fwrapv -Qunused-arguments -fPIC -fPIE -gdwarf-4 -Wall (Ubuntu_Clang_14.0.0)
opt64_lowsizeclang -march=native -O3 -fwrapv -Qunused-arguments -fPIC -fPIE -gdwarf-4 -Wall (Ubuntu_Clang_14.0.0)
opt64_lowsizeclang -march=native -O -fwrapv -Qunused-arguments -fPIC -fPIE -gdwarf-4 -Wall (Ubuntu_Clang_14.0.0)
opt64_lowsizeclang -march=native -Os -fwrapv -Qunused-arguments -fPIC -fPIE -gdwarf-4 -Wall (Ubuntu_Clang_14.0.0)
opt64_lowsizeclang -mcpu=native -O3 -fwrapv -Qunused-arguments -fPIC -fPIE -gdwarf-4 -Wall (Ubuntu_Clang_14.0.0)
opt64_lowsizegcc -march=native -mtune=native -O2 -fwrapv -fPIC -fPIE -gdwarf-4 -Wall (11.4.0)
opt64_lowsizegcc -march=native -mtune=native -O3 -fwrapv -fPIC -fPIE -gdwarf-4 -Wall (11.4.0)
opt64_lowsizegcc -march=native -mtune=native -O -fwrapv -fPIC -fPIE -gdwarf-4 -Wall (11.4.0)
opt64_lowsizegcc -march=native -mtune=native -Os -fwrapv -fPIC -fPIE -gdwarf-4 -Wall (11.4.0)

Namespace violations


aead.o ascon_adata T
aead.o ascon_decrypt T
aead.o ascon_encrypt T
aead.o ascon_final T
aead.o ascon_initaead T
aead.o ascon_loadkey T
permutations.o P T

Number of similar (implementation,compiler) pairs: 9, namely:
ImplementationCompiler
opt8clang -march=native -O2 -fwrapv -Qunused-arguments -fPIC -fPIE -gdwarf-4 -Wall (Ubuntu_Clang_14.0.0)
opt8clang -march=native -O3 -fwrapv -Qunused-arguments -fPIC -fPIE -gdwarf-4 -Wall (Ubuntu_Clang_14.0.0)
opt8clang -march=native -O -fwrapv -Qunused-arguments -fPIC -fPIE -gdwarf-4 -Wall (Ubuntu_Clang_14.0.0)
opt8clang -march=native -Os -fwrapv -Qunused-arguments -fPIC -fPIE -gdwarf-4 -Wall (Ubuntu_Clang_14.0.0)
opt8clang -mcpu=native -O3 -fwrapv -Qunused-arguments -fPIC -fPIE -gdwarf-4 -Wall (Ubuntu_Clang_14.0.0)
opt8gcc -march=native -mtune=native -O2 -fwrapv -fPIC -fPIE -gdwarf-4 -Wall (11.4.0)
opt8gcc -march=native -mtune=native -O3 -fwrapv -fPIC -fPIE -gdwarf-4 -Wall (11.4.0)
opt8gcc -march=native -mtune=native -O -fwrapv -fPIC -fPIE -gdwarf-4 -Wall (11.4.0)
opt8gcc -march=native -mtune=native -Os -fwrapv -fPIC -fPIE -gdwarf-4 -Wall (11.4.0)

Namespace violations


aead.o ascon_final T
aead.o ascon_initaead T
aead.o ascon_loadkey T
permutations.o P T
update.o ascon_update T

Number of similar (implementation,compiler) pairs: 9, namely:
ImplementationCompiler
opt8_lowsizeclang -march=native -O2 -fwrapv -Qunused-arguments -fPIC -fPIE -gdwarf-4 -Wall (Ubuntu_Clang_14.0.0)
opt8_lowsizeclang -march=native -O3 -fwrapv -Qunused-arguments -fPIC -fPIE -gdwarf-4 -Wall (Ubuntu_Clang_14.0.0)
opt8_lowsizeclang -march=native -O -fwrapv -Qunused-arguments -fPIC -fPIE -gdwarf-4 -Wall (Ubuntu_Clang_14.0.0)
opt8_lowsizeclang -march=native -Os -fwrapv -Qunused-arguments -fPIC -fPIE -gdwarf-4 -Wall (Ubuntu_Clang_14.0.0)
opt8_lowsizeclang -mcpu=native -O3 -fwrapv -Qunused-arguments -fPIC -fPIE -gdwarf-4 -Wall (Ubuntu_Clang_14.0.0)
opt8_lowsizegcc -march=native -mtune=native -O2 -fwrapv -fPIC -fPIE -gdwarf-4 -Wall (11.4.0)
opt8_lowsizegcc -march=native -mtune=native -O3 -fwrapv -fPIC -fPIE -gdwarf-4 -Wall (11.4.0)
opt8_lowsizegcc -march=native -mtune=native -O -fwrapv -fPIC -fPIE -gdwarf-4 -Wall (11.4.0)
opt8_lowsizegcc -march=native -mtune=native -Os -fwrapv -fPIC -fPIE -gdwarf-4 -Wall (11.4.0)

Passed TIMECOP


TIMECOP iterations: 10

Number of similar (implementation,compiler) pairs: 99, namely:
ImplementationCompiler
bi32clang -march=native -O2 -fwrapv -Qunused-arguments -fPIC -fPIE -gdwarf-4 -Wall (Ubuntu_Clang_14.0.0)
bi32clang -march=native -O3 -fwrapv -Qunused-arguments -fPIC -fPIE -gdwarf-4 -Wall (Ubuntu_Clang_14.0.0)
bi32clang -march=native -O -fwrapv -Qunused-arguments -fPIC -fPIE -gdwarf-4 -Wall (Ubuntu_Clang_14.0.0)
bi32clang -march=native -Os -fwrapv -Qunused-arguments -fPIC -fPIE -gdwarf-4 -Wall (Ubuntu_Clang_14.0.0)
bi32clang -mcpu=native -O3 -fwrapv -Qunused-arguments -fPIC -fPIE -gdwarf-4 -Wall (Ubuntu_Clang_14.0.0)
bi32gcc -march=native -mtune=native -O2 -fwrapv -fPIC -fPIE -gdwarf-4 -Wall (11.4.0)
bi32gcc -march=native -mtune=native -O3 -fwrapv -fPIC -fPIE -gdwarf-4 -Wall (11.4.0)
bi32gcc -march=native -mtune=native -O -fwrapv -fPIC -fPIE -gdwarf-4 -Wall (11.4.0)
bi32gcc -march=native -mtune=native -Os -fwrapv -fPIC -fPIE -gdwarf-4 -Wall (11.4.0)
bi32_lowregclang -march=native -O2 -fwrapv -Qunused-arguments -fPIC -fPIE -gdwarf-4 -Wall (Ubuntu_Clang_14.0.0)
bi32_lowregclang -march=native -O3 -fwrapv -Qunused-arguments -fPIC -fPIE -gdwarf-4 -Wall (Ubuntu_Clang_14.0.0)
bi32_lowregclang -march=native -O -fwrapv -Qunused-arguments -fPIC -fPIE -gdwarf-4 -Wall (Ubuntu_Clang_14.0.0)
bi32_lowregclang -march=native -Os -fwrapv -Qunused-arguments -fPIC -fPIE -gdwarf-4 -Wall (Ubuntu_Clang_14.0.0)
bi32_lowregclang -mcpu=native -O3 -fwrapv -Qunused-arguments -fPIC -fPIE -gdwarf-4 -Wall (Ubuntu_Clang_14.0.0)
bi32_lowreggcc -march=native -mtune=native -O2 -fwrapv -fPIC -fPIE -gdwarf-4 -Wall (11.4.0)
bi32_lowreggcc -march=native -mtune=native -O3 -fwrapv -fPIC -fPIE -gdwarf-4 -Wall (11.4.0)
bi32_lowreggcc -march=native -mtune=native -O -fwrapv -fPIC -fPIE -gdwarf-4 -Wall (11.4.0)
bi32_lowreggcc -march=native -mtune=native -Os -fwrapv -fPIC -fPIE -gdwarf-4 -Wall (11.4.0)
bi32_lowsizeclang -march=native -O2 -fwrapv -Qunused-arguments -fPIC -fPIE -gdwarf-4 -Wall (Ubuntu_Clang_14.0.0)
bi32_lowsizeclang -march=native -O3 -fwrapv -Qunused-arguments -fPIC -fPIE -gdwarf-4 -Wall (Ubuntu_Clang_14.0.0)
bi32_lowsizeclang -march=native -O -fwrapv -Qunused-arguments -fPIC -fPIE -gdwarf-4 -Wall (Ubuntu_Clang_14.0.0)
bi32_lowsizeclang -march=native -Os -fwrapv -Qunused-arguments -fPIC -fPIE -gdwarf-4 -Wall (Ubuntu_Clang_14.0.0)
bi32_lowsizeclang -mcpu=native -O3 -fwrapv -Qunused-arguments -fPIC -fPIE -gdwarf-4 -Wall (Ubuntu_Clang_14.0.0)
bi32_lowsizegcc -march=native -mtune=native -O2 -fwrapv -fPIC -fPIE -gdwarf-4 -Wall (11.4.0)
bi32_lowsizegcc -march=native -mtune=native -O3 -fwrapv -fPIC -fPIE -gdwarf-4 -Wall (11.4.0)
bi32_lowsizegcc -march=native -mtune=native -O -fwrapv -fPIC -fPIE -gdwarf-4 -Wall (11.4.0)
bi32_lowsizegcc -march=native -mtune=native -Os -fwrapv -fPIC -fPIE -gdwarf-4 -Wall (11.4.0)
bi8clang -march=native -O2 -fwrapv -Qunused-arguments -fPIC -fPIE -gdwarf-4 -Wall (Ubuntu_Clang_14.0.0)
bi8clang -march=native -O3 -fwrapv -Qunused-arguments -fPIC -fPIE -gdwarf-4 -Wall (Ubuntu_Clang_14.0.0)
bi8clang -march=native -O -fwrapv -Qunused-arguments -fPIC -fPIE -gdwarf-4 -Wall (Ubuntu_Clang_14.0.0)
bi8clang -march=native -Os -fwrapv -Qunused-arguments -fPIC -fPIE -gdwarf-4 -Wall (Ubuntu_Clang_14.0.0)
bi8clang -mcpu=native -O3 -fwrapv -Qunused-arguments -fPIC -fPIE -gdwarf-4 -Wall (Ubuntu_Clang_14.0.0)
bi8gcc -march=native -mtune=native -O2 -fwrapv -fPIC -fPIE -gdwarf-4 -Wall (11.4.0)
bi8gcc -march=native -mtune=native -O3 -fwrapv -fPIC -fPIE -gdwarf-4 -Wall (11.4.0)
bi8gcc -march=native -mtune=native -O -fwrapv -fPIC -fPIE -gdwarf-4 -Wall (11.4.0)
bi8gcc -march=native -mtune=native -Os -fwrapv -fPIC -fPIE -gdwarf-4 -Wall (11.4.0)
opt32clang -march=native -O2 -fwrapv -Qunused-arguments -fPIC -fPIE -gdwarf-4 -Wall (Ubuntu_Clang_14.0.0)
opt32clang -march=native -O3 -fwrapv -Qunused-arguments -fPIC -fPIE -gdwarf-4 -Wall (Ubuntu_Clang_14.0.0)
opt32clang -march=native -O -fwrapv -Qunused-arguments -fPIC -fPIE -gdwarf-4 -Wall (Ubuntu_Clang_14.0.0)
opt32clang -march=native -Os -fwrapv -Qunused-arguments -fPIC -fPIE -gdwarf-4 -Wall (Ubuntu_Clang_14.0.0)
opt32clang -mcpu=native -O3 -fwrapv -Qunused-arguments -fPIC -fPIE -gdwarf-4 -Wall (Ubuntu_Clang_14.0.0)
opt32gcc -march=native -mtune=native -O2 -fwrapv -fPIC -fPIE -gdwarf-4 -Wall (11.4.0)
opt32gcc -march=native -mtune=native -O3 -fwrapv -fPIC -fPIE -gdwarf-4 -Wall (11.4.0)
opt32gcc -march=native -mtune=native -O -fwrapv -fPIC -fPIE -gdwarf-4 -Wall (11.4.0)
opt32gcc -march=native -mtune=native -Os -fwrapv -fPIC -fPIE -gdwarf-4 -Wall (11.4.0)
opt32_lowsizeclang -march=native -O2 -fwrapv -Qunused-arguments -fPIC -fPIE -gdwarf-4 -Wall (Ubuntu_Clang_14.0.0)
opt32_lowsizeclang -march=native -O3 -fwrapv -Qunused-arguments -fPIC -fPIE -gdwarf-4 -Wall (Ubuntu_Clang_14.0.0)
opt32_lowsizeclang -march=native -O -fwrapv -Qunused-arguments -fPIC -fPIE -gdwarf-4 -Wall (Ubuntu_Clang_14.0.0)
opt32_lowsizeclang -march=native -Os -fwrapv -Qunused-arguments -fPIC -fPIE -gdwarf-4 -Wall (Ubuntu_Clang_14.0.0)
opt32_lowsizeclang -mcpu=native -O3 -fwrapv -Qunused-arguments -fPIC -fPIE -gdwarf-4 -Wall (Ubuntu_Clang_14.0.0)
opt32_lowsizegcc -march=native -mtune=native -O2 -fwrapv -fPIC -fPIE -gdwarf-4 -Wall (11.4.0)
opt32_lowsizegcc -march=native -mtune=native -O3 -fwrapv -fPIC -fPIE -gdwarf-4 -Wall (11.4.0)
opt32_lowsizegcc -march=native -mtune=native -O -fwrapv -fPIC -fPIE -gdwarf-4 -Wall (11.4.0)
opt32_lowsizegcc -march=native -mtune=native -Os -fwrapv -fPIC -fPIE -gdwarf-4 -Wall (11.4.0)
opt64clang -march=native -O2 -fwrapv -Qunused-arguments -fPIC -fPIE -gdwarf-4 -Wall (Ubuntu_Clang_14.0.0)
opt64clang -march=native -O3 -fwrapv -Qunused-arguments -fPIC -fPIE -gdwarf-4 -Wall (Ubuntu_Clang_14.0.0)
opt64clang -march=native -O -fwrapv -Qunused-arguments -fPIC -fPIE -gdwarf-4 -Wall (Ubuntu_Clang_14.0.0)
opt64clang -march=native -Os -fwrapv -Qunused-arguments -fPIC -fPIE -gdwarf-4 -Wall (Ubuntu_Clang_14.0.0)
opt64clang -mcpu=native -O3 -fwrapv -Qunused-arguments -fPIC -fPIE -gdwarf-4 -Wall (Ubuntu_Clang_14.0.0)
opt64gcc -march=native -mtune=native -O2 -fwrapv -fPIC -fPIE -gdwarf-4 -Wall (11.4.0)
opt64gcc -march=native -mtune=native -O3 -fwrapv -fPIC -fPIE -gdwarf-4 -Wall (11.4.0)
opt64gcc -march=native -mtune=native -O -fwrapv -fPIC -fPIE -gdwarf-4 -Wall (11.4.0)
opt64gcc -march=native -mtune=native -Os -fwrapv -fPIC -fPIE -gdwarf-4 -Wall (11.4.0)
opt64_lowsizeclang -march=native -O2 -fwrapv -Qunused-arguments -fPIC -fPIE -gdwarf-4 -Wall (Ubuntu_Clang_14.0.0)
opt64_lowsizeclang -march=native -O3 -fwrapv -Qunused-arguments -fPIC -fPIE -gdwarf-4 -Wall (Ubuntu_Clang_14.0.0)
opt64_lowsizeclang -march=native -O -fwrapv -Qunused-arguments -fPIC -fPIE -gdwarf-4 -Wall (Ubuntu_Clang_14.0.0)
opt64_lowsizeclang -march=native -Os -fwrapv -Qunused-arguments -fPIC -fPIE -gdwarf-4 -Wall (Ubuntu_Clang_14.0.0)
opt64_lowsizeclang -mcpu=native -O3 -fwrapv -Qunused-arguments -fPIC -fPIE -gdwarf-4 -Wall (Ubuntu_Clang_14.0.0)
opt64_lowsizegcc -march=native -mtune=native -O2 -fwrapv -fPIC -fPIE -gdwarf-4 -Wall (11.4.0)
opt64_lowsizegcc -march=native -mtune=native -O3 -fwrapv -fPIC -fPIE -gdwarf-4 -Wall (11.4.0)
opt64_lowsizegcc -march=native -mtune=native -O -fwrapv -fPIC -fPIE -gdwarf-4 -Wall (11.4.0)
opt64_lowsizegcc -march=native -mtune=native -Os -fwrapv -fPIC -fPIE -gdwarf-4 -Wall (11.4.0)
opt8clang -march=native -O2 -fwrapv -Qunused-arguments -fPIC -fPIE -gdwarf-4 -Wall (Ubuntu_Clang_14.0.0)
opt8clang -march=native -O3 -fwrapv -Qunused-arguments -fPIC -fPIE -gdwarf-4 -Wall (Ubuntu_Clang_14.0.0)
opt8clang -march=native -O -fwrapv -Qunused-arguments -fPIC -fPIE -gdwarf-4 -Wall (Ubuntu_Clang_14.0.0)
opt8clang -march=native -Os -fwrapv -Qunused-arguments -fPIC -fPIE -gdwarf-4 -Wall (Ubuntu_Clang_14.0.0)
opt8clang -mcpu=native -O3 -fwrapv -Qunused-arguments -fPIC -fPIE -gdwarf-4 -Wall (Ubuntu_Clang_14.0.0)
opt8gcc -march=native -mtune=native -O2 -fwrapv -fPIC -fPIE -gdwarf-4 -Wall (11.4.0)
opt8gcc -march=native -mtune=native -O3 -fwrapv -fPIC -fPIE -gdwarf-4 -Wall (11.4.0)
opt8gcc -march=native -mtune=native -O -fwrapv -fPIC -fPIE -gdwarf-4 -Wall (11.4.0)
opt8gcc -march=native -mtune=native -Os -fwrapv -fPIC -fPIE -gdwarf-4 -Wall (11.4.0)
opt8_lowsizeclang -march=native -O2 -fwrapv -Qunused-arguments -fPIC -fPIE -gdwarf-4 -Wall (Ubuntu_Clang_14.0.0)
opt8_lowsizeclang -march=native -O3 -fwrapv -Qunused-arguments -fPIC -fPIE -gdwarf-4 -Wall (Ubuntu_Clang_14.0.0)
opt8_lowsizeclang -march=native -O -fwrapv -Qunused-arguments -fPIC -fPIE -gdwarf-4 -Wall (Ubuntu_Clang_14.0.0)
opt8_lowsizeclang -march=native -Os -fwrapv -Qunused-arguments -fPIC -fPIE -gdwarf-4 -Wall (Ubuntu_Clang_14.0.0)
opt8_lowsizeclang -mcpu=native -O3 -fwrapv -Qunused-arguments -fPIC -fPIE -gdwarf-4 -Wall (Ubuntu_Clang_14.0.0)
opt8_lowsizegcc -march=native -mtune=native -O2 -fwrapv -fPIC -fPIE -gdwarf-4 -Wall (11.4.0)
opt8_lowsizegcc -march=native -mtune=native -O3 -fwrapv -fPIC -fPIE -gdwarf-4 -Wall (11.4.0)
opt8_lowsizegcc -march=native -mtune=native -O -fwrapv -fPIC -fPIE -gdwarf-4 -Wall (11.4.0)
opt8_lowsizegcc -march=native -mtune=native -Os -fwrapv -fPIC -fPIE -gdwarf-4 -Wall (11.4.0)
refclang -march=native -O2 -fwrapv -Qunused-arguments -fPIC -fPIE -gdwarf-4 -Wall (Ubuntu_Clang_14.0.0)
refclang -march=native -O3 -fwrapv -Qunused-arguments -fPIC -fPIE -gdwarf-4 -Wall (Ubuntu_Clang_14.0.0)
refclang -march=native -O -fwrapv -Qunused-arguments -fPIC -fPIE -gdwarf-4 -Wall (Ubuntu_Clang_14.0.0)
refclang -march=native -Os -fwrapv -Qunused-arguments -fPIC -fPIE -gdwarf-4 -Wall (Ubuntu_Clang_14.0.0)
refclang -mcpu=native -O3 -fwrapv -Qunused-arguments -fPIC -fPIE -gdwarf-4 -Wall (Ubuntu_Clang_14.0.0)
refgcc -march=native -mtune=native -O2 -fwrapv -fPIC -fPIE -gdwarf-4 -Wall (11.4.0)
refgcc -march=native -mtune=native -O3 -fwrapv -fPIC -fPIE -gdwarf-4 -Wall (11.4.0)
refgcc -march=native -mtune=native -O -fwrapv -fPIC -fPIE -gdwarf-4 -Wall (11.4.0)
refgcc -march=native -mtune=native -Os -fwrapv -fPIC -fPIE -gdwarf-4 -Wall (11.4.0)