Test results for amd64, alder2,1f626960,3300000, crypto_kem/titaniumccamed

[Page version: 20250324 16:18:00]

Measurements for amd64, alder2,1f626960,3300000, crypto_kem Test results for amd64, alder2,1f626960,3300000, crypto_kem Test results for crypto_kem/titaniumccamed
Computer: alder2,1f626960,3300000
Microarchitecture: amd64; Gracemont (906a4-20)
Architecture: amd64
CPU ID: GenuineIntel-000906a4-20-bfebfbff
SUPERCOP version: 20250307
Operation: crypto_kem
Primitive: titaniumccamed
TimeObject sizeTest sizeImplementationCompilerBenchmark dateSUPERCOP version
371382986333 0 64203712 788 1816T:avx2gcc -march=native -mtune=native -O2 -fwrapv -fPIC -fPIE -gdwarf-4 -Wall2025031920250307
371848087700 0 64206928 788 1816T:avx2gcc -march=native -mtune=native -O3 -fwrapv -fPIC -fPIE -gdwarf-4 -Wall2025031920250307
387649386319 0 64203264 788 1816T:avx2gcc -march=native -mtune=native -O -fwrapv -fPIC -fPIE -gdwarf-4 -Wall2025031920250307
395159883259 0 36201896 820 1752T:optclang -march=native -O3 -fwrapv -Qunused-arguments -fPIC -fPIE -gdwarf-4 -Wall2025031920250307
402141972396 0 36190888 820 1752T:optclang -march=native -O2 -fwrapv -Qunused-arguments -fPIC -fPIE -gdwarf-4 -Wall2025031920250307
421144763901 0 36182888 820 1752T:optclang -mcpu=native -O3 -fwrapv -Qunused-arguments -fPIC -fPIE -gdwarf-4 -Wall2025031920250307
455740545330 0 36161710 812 1752T:optclang -march=native -Os -fwrapv -Qunused-arguments -fPIC -fPIE -gdwarf-4 -Wall2025031920250307
485503246854 0 64164384 788 1816T:optgcc -march=native -mtune=native -O2 -fwrapv -fPIC -fPIE -gdwarf-4 -Wall2025031920250307
499552380824 0 64199832 788 1816T:optgcc -march=native -mtune=native -O3 -fwrapv -fPIC -fPIE -gdwarf-4 -Wall2025031920250307
502676647006 0 64164144 788 1816T:optgcc -march=native -mtune=native -O -fwrapv -fPIC -fPIE -gdwarf-4 -Wall2025031920250307
52971345545592 0 36164264 820 1752T:refclang -march=native -O2 -fwrapv -Qunused-arguments -fPIC -fPIE -gdwarf-4 -Wall2025031920250307
53009640978353 0 36197216 820 1752T:refclang -march=native -O3 -fwrapv -Qunused-arguments -fPIC -fPIE -gdwarf-4 -Wall2025031920250307
53291262455383 0 36174280 820 1752T:refclang -mcpu=native -O3 -fwrapv -Qunused-arguments -fPIC -fPIE -gdwarf-4 -Wall2025031920250307
54535072336340 0 36152654 812 1752T:refclang -march=native -Os -fwrapv -Qunused-arguments -fPIC -fPIE -gdwarf-4 -Wall2025031920250307
54623159336243 0 36152942 812 1752T:refclang -march=native -O -fwrapv -Qunused-arguments -fPIC -fPIE -gdwarf-4 -Wall2025031920250307
58988041160511 0 64179504 788 1816T:refgcc -march=native -mtune=native -O3 -fwrapv -fPIC -fPIE -gdwarf-4 -Wall2025031920250307
59154435135685 0 64153096 788 1816T:refgcc -march=native -mtune=native -O2 -fwrapv -fPIC -fPIE -gdwarf-4 -Wall2025031920250307
60231911035879 0 64152864 788 1816T:refgcc -march=native -mtune=native -O -fwrapv -fPIC -fPIE -gdwarf-4 -Wall2025031920250307
91480230534432 0 64150232 780 1784T:refgcc -march=native -mtune=native -Os -fwrapv -fPIC -fPIE -gdwarf-4 -Wall2025031920250307

Compiler output


encrypt.c: In file included from encrypt.c:18:
encrypt.c: In file included from /usr/lib/llvm-11/lib/clang/11.0.1/include/x86intrin.h:13:
encrypt.c: /usr/lib/llvm-11/lib/clang/11.0.1/include/ia32intrin.h:210:16: error: expected identifier or '('
encrypt.c:   unsigned int D;
encrypt.c:                ^
encrypt.c: ./param.h:28:11: note: expanded from macro 'D'
encrypt.c: #define D 256
encrypt.c:           ^
encrypt.c: In file included from encrypt.c:18:
encrypt.c: In file included from /usr/lib/llvm-11/lib/clang/11.0.1/include/x86intrin.h:13:
encrypt.c: /usr/lib/llvm-11/lib/clang/11.0.1/include/ia32intrin.h:211:20: error: cannot take the address of an rvalue of type 'int'
encrypt.c:   __builtin_memcpy(&D, &__A, sizeof(__A));
encrypt.c:                    ^~
encrypt.c: /usr/lib/llvm-11/lib/clang/11.0.1/include/ia32intrin.h:227:22: error: expected identifier or '('
encrypt.c:   unsigned long long D;
encrypt.c:                      ^
encrypt.c: ./param.h:28:11: note: expanded from macro 'D'
encrypt.c: #define D 256
encrypt.c:           ^
encrypt.c: In file included from encrypt.c:18:
encrypt.c: In file included from /usr/lib/llvm-11/lib/clang/11.0.1/include/x86intrin.h:13:
encrypt.c: /usr/lib/llvm-11/lib/clang/11.0.1/include/ia32intrin.h:228:20: error: cannot take the address of an rvalue of type 'int'
encrypt.c:   __builtin_memcpy(&D, &__A, sizeof(__A));
encrypt.c:                    ^~
encrypt.c: /usr/lib/llvm-11/lib/clang/11.0.1/include/ia32intrin.h:244:9: error: expected identifier or '('
encrypt.c: ...

Number of similar (implementation,compiler) pairs: 5, namely:
ImplementationCompiler
T:avx2clang -march=native -O2 -fwrapv -Qunused-arguments -fPIC -fPIE -gdwarf-4 -Wall (Debian_Clang_11.0.1)
T:avx2clang -march=native -O3 -fwrapv -Qunused-arguments -fPIC -fPIE -gdwarf-4 -Wall (Debian_Clang_11.0.1)
T:avx2clang -march=native -O -fwrapv -Qunused-arguments -fPIC -fPIE -gdwarf-4 -Wall (Debian_Clang_11.0.1)
T:avx2clang -march=native -Os -fwrapv -Qunused-arguments -fPIC -fPIE -gdwarf-4 -Wall (Debian_Clang_11.0.1)
T:avx2clang -mcpu=native -O3 -fwrapv -Qunused-arguments -fPIC -fPIE -gdwarf-4 -Wall (Debian_Clang_11.0.1)

Compiler output


try.c: /usr/bin/ld: libcrypto_kem_titaniumccamed.a(sampler.o): in function `sampler_zq':
try.c: .../supercop-data/alder2,1f626960,3300000/amd64/try/c/gcc_-march=native_-mtune=native_-Os_-fwrapv_-fPIC_-fPIE_-gdwarf-4_-Wall/timingleaks/crypto_kem/titaniumccamed/avx2/work/sampler.c:160: undefined reference to `barrett_zq'
try.c: collect2: error: ld returned 1 exit status

Number of similar (implementation,compiler) pairs: 1, namely:
ImplementationCompiler
T:avx2gcc -march=native -mtune=native -Os -fwrapv -fPIC -fPIE -gdwarf-4 -Wall (10.2.1_20210110)

Compiler output


try.c: /usr/bin/ld: libcrypto_kem_titaniumccamed.a(encrypt.o): in function `crypto_encrypt_keypair':
try.c: .../supercop-data/alder2,1f626960,3300000/amd64/try/c/clang_-march=native_-O_-fwrapv_-Qunused-arguments_-fPIC_-fPIE_-gdwarf-4_-Wall/timingleaks/crypto_kem/titaniumccamed/opt/work/encrypt.c:55: undefined reference to `barrett_4q2'
try.c: /usr/bin/ld: .../supercop-data/alder2,1f626960,3300000/amd64/try/c/clang_-march=native_-O_-fwrapv_-Qunused-arguments_-fPIC_-fPIE_-gdwarf-4_-Wall/timingleaks/crypto_kem/titaniumccamed/opt/work/encrypt.c:63: undefined reference to `barrett_4q'
try.c: /usr/bin/ld: libcrypto_kem_titaniumccamed.a(encrypt.o): in function `crypto_encrypt':
try.c: .../supercop-data/alder2,1f626960,3300000/amd64/try/c/clang_-march=native_-O_-fwrapv_-Qunused-arguments_-fPIC_-fPIE_-gdwarf-4_-Wall/timingleaks/crypto_kem/titaniumccamed/opt/work/encrypt.c:140: undefined reference to `barrett_4q2'
try.c: /usr/bin/ld: .../supercop-data/alder2,1f626960,3300000/amd64/try/c/clang_-march=native_-O_-fwrapv_-Qunused-arguments_-fPIC_-fPIE_-gdwarf-4_-Wall/timingleaks/crypto_kem/titaniumccamed/opt/work/encrypt.c:150: undefined reference to `barrett_4q2'
try.c: /usr/bin/ld: libcrypto_kem_titaniumccamed.a(encrypt.o): in function `crypto_encrypt_open':
try.c: .../supercop-data/alder2,1f626960,3300000/amd64/try/c/clang_-march=native_-O_-fwrapv_-Qunused-arguments_-fPIC_-fPIE_-gdwarf-4_-Wall/timingleaks/crypto_kem/titaniumccamed/opt/work/encrypt.c:194: undefined reference to `barrett_4q2'
try.c: /usr/bin/ld: libcrypto_kem_titaniumccamed.a(ntt.o): in function `ntt_core':
try.c: .../supercop-data/alder2,1f626960,3300000/amd64/try/c/clang_-march=native_-O_-fwrapv_-Qunused-arguments_-fPIC_-fPIE_-gdwarf-4_-Wall/timingleaks/crypto_kem/titaniumccamed/opt/work/ntt.c:295: undefined reference to `barrett_2q2'
try.c: /usr/bin/ld: libcrypto_kem_titaniumccamed.a(ntt.o): in function `ntt_butterfly_1280_2048':
try.c: .../supercop-data/alder2,1f626960,3300000/amd64/try/c/clang_-march=native_-O_-fwrapv_-Qunused-arguments_-fPIC_-fPIE_-gdwarf-4_-Wall/timingleaks/crypto_kem/titaniumccamed/opt/work/ntt.c:350: undefined reference to `barrett_16q'
try.c: /usr/bin/ld: libcrypto_kem_titaniumccamed.a(ntt.o): in function `intt_core':
try.c: .../supercop-data/alder2,1f626960,3300000/amd64/try/c/clang_-march=native_-O_-fwrapv_-Qunused-arguments_-fPIC_-fPIE_-gdwarf-4_-Wall/timingleaks/crypto_kem/titaniumccamed/opt/work/ntt.c:323: undefined reference to `barrett_2q2'
try.c: /usr/bin/ld: .../supercop-data/alder2,1f626960,3300000/amd64/try/c/clang_-march=native_-O_-fwrapv_-Qunused-arguments_-fPIC_-fPIE_-gdwarf-4_-Wall/timingleaks/crypto_kem/titaniumccamed/opt/work/ntt.c:335: undefined reference to `barrett_2q2'
try.c: /usr/bin/ld: libcrypto_kem_titaniumccamed.a(ntt.o): in function `ntt_butterfly_2048_768':
try.c: .../supercop-data/alder2,1f626960,3300000/amd64/try/c/clang_-march=native_-O_-fwrapv_-Qunused-arguments_-fPIC_-fPIE_-gdwarf-4_-Wall/timingleaks/crypto_kem/titaniumccamed/opt/work/ntt.c:374: undefined reference to `barrett_16q'
try.c: /usr/bin/ld: libcrypto_kem_titaniumccamed.a(ntt.o): in function `ntt_butterfly_512_1792':
try.c: .../supercop-data/alder2,1f626960,3300000/amd64/try/c/clang_-march=native_-O_-fwrapv_-Qunused-arguments_-fPIC_-fPIE_-gdwarf-4_-Wall/timingleaks/crypto_kem/titaniumccamed/opt/work/ntt.c:387: undefined reference to `barrett_4q'
try.c: /usr/bin/ld: libcrypto_kem_titaniumccamed.a(ntt.o): in function `ntt_butterfly_1280_1792':
try.c: .../supercop-data/alder2,1f626960,3300000/amd64/try/c/clang_-march=native_-O_-fwrapv_-Qunused-arguments_-fPIC_-fPIE_-gdwarf-4_-Wall/timingleaks/crypto_kem/titaniumccamed/opt/work/ntt.c:407: undefined reference to `barrett_16q'
try.c: /usr/bin/ld: libcrypto_kem_titaniumccamed.a(ntt.o): in function `ntt_butterfly_1792_1792_inv':
try.c: .../supercop-data/alder2,1f626960,3300000/amd64/try/c/clang_-march=native_-O_-fwrapv_-Qunused-arguments_-fPIC_-fPIE_-gdwarf-4_-Wall/timingleaks/crypto_kem/titaniumccamed/opt/work/ntt.c:429: undefined reference to `barrett_16q'
try.c: /usr/bin/ld: libcrypto_kem_titaniumccamed.a(ntt.o): in function `ntt_butterfly_768_768_inv':
try.c: .../supercop-data/alder2,1f626960,3300000/amd64/try/c/clang_-march=native_-O_-fwrapv_-Qunused-arguments_-fPIC_-fPIE_-gdwarf-4_-Wall/timingleaks/crypto_kem/titaniumccamed/opt/work/ntt.c:447: undefined reference to `barrett_8q'
try.c: ...

Number of similar (implementation,compiler) pairs: 1, namely:
ImplementationCompiler
T:optclang -march=native -O -fwrapv -Qunused-arguments -fPIC -fPIE -gdwarf-4 -Wall (Debian_Clang_11.0.1)

Compiler output


try.c: /usr/bin/ld: libcrypto_kem_titaniumccamed.a(encrypt.o): in function `crypto_encrypt_keypair':
try.c: .../supercop-data/alder2,1f626960,3300000/amd64/try/c/gcc_-march=native_-mtune=native_-Os_-fwrapv_-fPIC_-fPIE_-gdwarf-4_-Wall/timingleaks/crypto_kem/titaniumccamed/opt/work/encrypt.c:55: undefined reference to `barrett_4q2'
try.c: /usr/bin/ld: .../supercop-data/alder2,1f626960,3300000/amd64/try/c/gcc_-march=native_-mtune=native_-Os_-fwrapv_-fPIC_-fPIE_-gdwarf-4_-Wall/timingleaks/crypto_kem/titaniumccamed/opt/work/encrypt.c:63: undefined reference to `barrett_4q'
try.c: /usr/bin/ld: libcrypto_kem_titaniumccamed.a(encrypt.o): in function `crypto_encrypt':
try.c: .../supercop-data/alder2,1f626960,3300000/amd64/try/c/gcc_-march=native_-mtune=native_-Os_-fwrapv_-fPIC_-fPIE_-gdwarf-4_-Wall/timingleaks/crypto_kem/titaniumccamed/opt/work/encrypt.c:140: undefined reference to `barrett_4q2'
try.c: /usr/bin/ld: .../supercop-data/alder2,1f626960,3300000/amd64/try/c/gcc_-march=native_-mtune=native_-Os_-fwrapv_-fPIC_-fPIE_-gdwarf-4_-Wall/timingleaks/crypto_kem/titaniumccamed/opt/work/encrypt.c:150: undefined reference to `barrett_4q2'
try.c: /usr/bin/ld: libcrypto_kem_titaniumccamed.a(encrypt.o): in function `crypto_encrypt_open':
try.c: .../supercop-data/alder2,1f626960,3300000/amd64/try/c/gcc_-march=native_-mtune=native_-Os_-fwrapv_-fPIC_-fPIE_-gdwarf-4_-Wall/timingleaks/crypto_kem/titaniumccamed/opt/work/encrypt.c:194: undefined reference to `barrett_4q2'
try.c: /usr/bin/ld: libcrypto_kem_titaniumccamed.a(ntt.o): in function `ntt_butterfly_1280_2048':
try.c: .../supercop-data/alder2,1f626960,3300000/amd64/try/c/gcc_-march=native_-mtune=native_-Os_-fwrapv_-fPIC_-fPIE_-gdwarf-4_-Wall/timingleaks/crypto_kem/titaniumccamed/opt/work/ntt.c:350: undefined reference to `barrett_16q'
try.c: /usr/bin/ld: libcrypto_kem_titaniumccamed.a(ntt.o): in function `ntt_butterfly_2048_768':
try.c: .../supercop-data/alder2,1f626960,3300000/amd64/try/c/gcc_-march=native_-mtune=native_-Os_-fwrapv_-fPIC_-fPIE_-gdwarf-4_-Wall/timingleaks/crypto_kem/titaniumccamed/opt/work/ntt.c:374: undefined reference to `barrett_16q'
try.c: /usr/bin/ld: libcrypto_kem_titaniumccamed.a(ntt.o): in function `ntt_butterfly_512_1792':
try.c: .../supercop-data/alder2,1f626960,3300000/amd64/try/c/gcc_-march=native_-mtune=native_-Os_-fwrapv_-fPIC_-fPIE_-gdwarf-4_-Wall/timingleaks/crypto_kem/titaniumccamed/opt/work/ntt.c:387: undefined reference to `barrett_4q'
try.c: /usr/bin/ld: libcrypto_kem_titaniumccamed.a(ntt.o): in function `ntt_butterfly_1280_1792':
try.c: .../supercop-data/alder2,1f626960,3300000/amd64/try/c/gcc_-march=native_-mtune=native_-Os_-fwrapv_-fPIC_-fPIE_-gdwarf-4_-Wall/timingleaks/crypto_kem/titaniumccamed/opt/work/ntt.c:407: undefined reference to `barrett_16q'
try.c: /usr/bin/ld: libcrypto_kem_titaniumccamed.a(ntt.o): in function `ntt_butterfly_1792_1792_inv':
try.c: .../supercop-data/alder2,1f626960,3300000/amd64/try/c/gcc_-march=native_-mtune=native_-Os_-fwrapv_-fPIC_-fPIE_-gdwarf-4_-Wall/timingleaks/crypto_kem/titaniumccamed/opt/work/ntt.c:429: undefined reference to `barrett_16q'
try.c: /usr/bin/ld: libcrypto_kem_titaniumccamed.a(ntt.o): in function `ntt_butterfly_768_768_inv':
try.c: .../supercop-data/alder2,1f626960,3300000/amd64/try/c/gcc_-march=native_-mtune=native_-Os_-fwrapv_-fPIC_-fPIE_-gdwarf-4_-Wall/timingleaks/crypto_kem/titaniumccamed/opt/work/ntt.c:447: undefined reference to `barrett_8q'
try.c: /usr/bin/ld: libcrypto_kem_titaniumccamed.a(ntt.o): in function `ntt_butterfly_512_768':
try.c: .../supercop-data/alder2,1f626960,3300000/amd64/try/c/gcc_-march=native_-mtune=native_-Os_-fwrapv_-fPIC_-fPIE_-gdwarf-4_-Wall/timingleaks/crypto_kem/titaniumccamed/opt/work/ntt.c:460: undefined reference to `barrett_4q'
try.c: /usr/bin/ld: libcrypto_kem_titaniumccamed.a(ntt.o): in function `ntt_butterfly_768_256':
try.c: .../supercop-data/alder2,1f626960,3300000/amd64/try/c/gcc_-march=native_-mtune=native_-Os_-fwrapv_-fPIC_-fPIE_-gdwarf-4_-Wall/timingleaks/crypto_kem/titaniumccamed/opt/work/ntt.c:468: undefined reference to `barrett_8q'
try.c: /usr/bin/ld: libcrypto_kem_titaniumccamed.a(ntt.o): in function `ntt_butterfly_1792_2048':
try.c: ...

Number of similar (implementation,compiler) pairs: 1, namely:
ImplementationCompiler
T:optgcc -march=native -mtune=native -Os -fwrapv -fPIC -fPIE -gdwarf-4 -Wall (10.2.1_20210110)

Namespace violations


encrypt.o crypto_encrypt T
encrypt.o crypto_encrypt_keypair T
encrypt.o crypto_encrypt_open T
fastrandombytes.o fastrandombytes T
fastrandombytes.o fastrandombytes_setseed T
fastrandombytes.o iv B
fastrandombytes.o key B
ntt.o intt_1792_1792_inv T
ntt.o intt_2048_256 T
ntt.o intt_2048_768 T
ntt.o intt_768_256 T
ntt.o ntt_1280_1792 T
ntt.o ntt_1280_2048 T
ntt.o ntt_1792_2048 T
ntt.o ntt_512_1792 T
ntt.o ntt_512_768 T
ntt.o ntt_768_768_inv T
pack.o poly_decode T
pack.o poly_decode_c2 T
pack.o poly_encode T
pack.o poly_encode_c2 T
sampler.o sampler_binomial T
sampler.o sampler_zb T
sampler.o sampler_zq T

Number of similar (implementation,compiler) pairs: 10, namely:
ImplementationCompiler
T:avx2gcc -march=native -mtune=native -O2 -fwrapv -fPIC -fPIE -gdwarf-4 -Wall (10.2.1_20210110)
T:avx2gcc -march=native -mtune=native -O3 -fwrapv -fPIC -fPIE -gdwarf-4 -Wall (10.2.1_20210110)
T:avx2gcc -march=native -mtune=native -O -fwrapv -fPIC -fPIE -gdwarf-4 -Wall (10.2.1_20210110)
T:optclang -march=native -O2 -fwrapv -Qunused-arguments -fPIC -fPIE -gdwarf-4 -Wall (Debian_Clang_11.0.1)
T:optclang -march=native -O3 -fwrapv -Qunused-arguments -fPIC -fPIE -gdwarf-4 -Wall (Debian_Clang_11.0.1)
T:optclang -march=native -Os -fwrapv -Qunused-arguments -fPIC -fPIE -gdwarf-4 -Wall (Debian_Clang_11.0.1)
T:optclang -mcpu=native -O3 -fwrapv -Qunused-arguments -fPIC -fPIE -gdwarf-4 -Wall (Debian_Clang_11.0.1)
T:optgcc -march=native -mtune=native -O2 -fwrapv -fPIC -fPIE -gdwarf-4 -Wall (10.2.1_20210110)
T:optgcc -march=native -mtune=native -O3 -fwrapv -fPIC -fPIE -gdwarf-4 -Wall (10.2.1_20210110)
T:optgcc -march=native -mtune=native -O -fwrapv -fPIC -fPIE -gdwarf-4 -Wall (10.2.1_20210110)

Namespace violations


encrypt.o crypto_encrypt T
encrypt.o crypto_encrypt_keypair T
encrypt.o crypto_encrypt_open T
fastrandombytes.o fastrandombytes T
fastrandombytes.o fastrandombytes_setseed T
fastrandombytes.o iv B
fastrandombytes.o key B
ntt.o intt_1792_1792_inv T
ntt.o intt_2048_2048 T
ntt.o intt_768_768 T
ntt.o ntt_1792_1792 T
ntt.o ntt_768_768_inv T
pack.o poly_decode T
pack.o poly_decode_c2 T
pack.o poly_encode T
pack.o poly_encode_c2 T
product.o mp T
product.o product T
sampler.o sampler_binomial T
sampler.o sampler_zb T
sampler.o sampler_zq T

Number of similar (implementation,compiler) pairs: 9, namely:
ImplementationCompiler
T:refclang -march=native -O2 -fwrapv -Qunused-arguments -fPIC -fPIE -gdwarf-4 -Wall (Debian_Clang_11.0.1)
T:refclang -march=native -O3 -fwrapv -Qunused-arguments -fPIC -fPIE -gdwarf-4 -Wall (Debian_Clang_11.0.1)
T:refclang -march=native -O -fwrapv -Qunused-arguments -fPIC -fPIE -gdwarf-4 -Wall (Debian_Clang_11.0.1)
T:refclang -march=native -Os -fwrapv -Qunused-arguments -fPIC -fPIE -gdwarf-4 -Wall (Debian_Clang_11.0.1)
T:refclang -mcpu=native -O3 -fwrapv -Qunused-arguments -fPIC -fPIE -gdwarf-4 -Wall (Debian_Clang_11.0.1)
T:refgcc -march=native -mtune=native -O2 -fwrapv -fPIC -fPIE -gdwarf-4 -Wall (10.2.1_20210110)
T:refgcc -march=native -mtune=native -O3 -fwrapv -fPIC -fPIE -gdwarf-4 -Wall (10.2.1_20210110)
T:refgcc -march=native -mtune=native -O -fwrapv -fPIC -fPIE -gdwarf-4 -Wall (10.2.1_20210110)
T:refgcc -march=native -mtune=native -Os -fwrapv -fPIC -fPIE -gdwarf-4 -Wall (10.2.1_20210110)