Test results for aarch64, cfarm425, crypto_kem/lightsaber2
[Page version: 20261005 22:53:57]
Measurements for aarch64, cfarm425, crypto_kem
Test results for aarch64, cfarm425, crypto_kem
Test results for crypto_kem/lightsaber2
Computer: cfarm425
Microarchitecture: aarch64; Cortex-A76 (413fd0c1)
Architecture: aarch64
CPU ID: 413fd0c1
SUPERCOP version: 20261004
Operation: crypto_kem
Primitive: lightsaber2
| Time | Object size | Test size | Implementation | Compiler | Benchmark date | SUPERCOP version |
| 213863 | 33957 0 0 | 60915 1216 2248 | T:ref | gcc -march=native -mtune=native -O3 -fwrapv -fPIC -fPIE -gdwarf-4 -Wall | 20261005 | 20261004 |
Compiler output
SABER_indcpa.c: In file included from SABER_indcpa.c:5:
SABER_indcpa.c: SABER_indcpa.h:4:10: fatal error: immintrin.h: No such file or directory
SABER_indcpa.c: 4 | #include <immintrin.h>
SABER_indcpa.c: | ^~~~~~~~~~~~~
SABER_indcpa.c: compilation terminated.
Number of similar (implementation,compiler) pairs: 1, namely:
| Implementation | Compiler |
| T:avx2 | gcc -march=native -mtune=native -O3 -fwrapv -fPIC -fPIE -gdwarf-4 -Wall (16.2.0) |
Compiler output
SABER_indcpa.c: In file included from SABER_indcpa.c:20:
SABER_indcpa.c: SABER_indcpa.h:4:10: fatal error: immintrin.h: No such file or directory
SABER_indcpa.c: 4 | #include <immintrin.h>
SABER_indcpa.c: | ^~~~~~~~~~~~~
SABER_indcpa.c: compilation terminated.
Number of similar (implementation,compiler) pairs: 1, namely:
| Implementation | Compiler |
| T:avx2_nttmul | gcc -march=native -mtune=native -O3 -fwrapv -fPIC -fPIE -gdwarf-4 -Wall (16.2.0) |
Compiler output
SABER_indcpa.c: In file included from polymul/toom_cook_4/asimd_toom_cook_4way_neon.c:22,
SABER_indcpa.c: from SABER_indcpa.c:35:
SABER_indcpa.c: polymul/toom_cook_4/asimd_toom_cook_4way_neon.c: In function 'toom_cook_4way_neon':
SABER_indcpa.c: polymul/toom_cook_4/batch_64coefficient_multiplications.c:76:35: warning: 'w1' is used uninitialized [-Wuninitialized]
SABER_indcpa.c: 76 | c.val[0] = veorq_u16(a.val[0], b.val[0]); \
SABER_indcpa.c: polymul/toom_cook_4/asimd_toom_cook_4way_neon.c:77:9: note: in expansion of macro 'vxor'
SABER_indcpa.c: 77 | vxor(int0_avx, w1, w1);
SABER_indcpa.c: | ^~~~
SABER_indcpa.c: polymul/toom_cook_4/asimd_toom_cook_4way_neon.c:70:18: note: 'w1' declared here
SABER_indcpa.c: 70 | uint16x8x2_t w1, w2, w3, w4, w5, w6, w7;
SABER_indcpa.c: | ^~
poly.c: poly.c: In function 'poly_getnoise':
poly.c: poly.c:19:3: error: implicit declaration of function 'cshake128_simple' [-Wimplicit-function-declaration]
poly.c: 19 | cshake128_simple(buf,SABER_N,nonce,seed,SABER_NOISESEEDBYTES);
poly.c: | ^~~~~~~~~~~~~~~~
Number of similar (implementation,compiler) pairs: 1, namely:
| Implementation | Compiler |
| T:neon | gcc -march=native -mtune=native -O3 -fwrapv -fPIC -fPIE -gdwarf-4 -Wall (16.2.0) |
Compiler output
SABER_indcpa.c: In file included from SABER_indcpa.c:22:
SABER_indcpa.c: rq_mul/neon_poly_rq_mul.c: In function 'tc4_evaluate_neon_SB1':
SABER_indcpa.c: rq_mul/neon_poly_rq_mul.c:272:20: warning: initialization discards 'const' qualifier from pointer target type [-Wdiscarded-qualifiers]
SABER_indcpa.c: 272 | uint16_t *c0 = poly,
SABER_indcpa.c: | ^~~~
SABER_indcpa.c: rq_mul/neon_poly_rq_mul.c:273:20: warning: initialization discards 'const' qualifier from pointer target type [-Wdiscarded-qualifiers]
SABER_indcpa.c: 273 | *c1 = &poly[1 * SB1],
SABER_indcpa.c: | ^
SABER_indcpa.c: rq_mul/neon_poly_rq_mul.c:274:20: warning: initialization discards 'const' qualifier from pointer target type [-Wdiscarded-qualifiers]
SABER_indcpa.c: 274 | *c2 = &poly[2 * SB1],
SABER_indcpa.c: | ^
SABER_indcpa.c: rq_mul/neon_poly_rq_mul.c:275:20: warning: initialization discards 'const' qualifier from pointer target type [-Wdiscarded-qualifiers]
SABER_indcpa.c: 275 | *c3 = &poly[3 * SB1],
SABER_indcpa.c: | ^
SABER_indcpa.c: rq_mul/neon_poly_rq_mul.c: In function 'neon_vector_vector_mul':
SABER_indcpa.c: rq_mul/neon_poly_rq_mul.c:501:16: warning: unused variable 'mod' [-Wunused-variable]
SABER_indcpa.c: 501 | uint16x8_t mod;
SABER_indcpa.c: | ^~~
SABER_indcpa.c: SABER_indcpa.c: In function 'indcpa_kem_keypair':
SABER_indcpa.c: SABER_indcpa.c:194:16: warning: unused variable 'acc_neon' [-Wunused-variable]
SABER_indcpa.c: 194 | uint16x8x4_t acc_neon;
SABER_indcpa.c: | ^~~~~~~~
SABER_indcpa.c: SABER_indcpa.c:188:17: warning: unused variable 'k' [-Wunused-variable]
SABER_indcpa.c: 188 | int32_t i, j, k;
SABER_indcpa.c: | ^
SABER_indcpa.c: ...
poly.c: poly.c: In function 'poly_getnoise':
poly.c: poly.c:19:3: error: implicit declaration of function 'cshake128_simple' [-Wimplicit-function-declaration]
poly.c: 19 | cshake128_simple(buf,SABER_N,nonce,seed,SABER_NOISESEEDBYTES);
poly.c: | ^~~~~~~~~~~~~~~~
Number of similar (implementation,compiler) pairs: 1, namely:
| Implementation | Compiler |
| T:neon2 | gcc -march=native -mtune=native -O3 -fwrapv -fPIC -fPIE -gdwarf-4 -Wall (16.2.0) |
Namespace violations
SABER_indcpa.o GenMatrix T
SABER_indcpa.o InnerProd T
SABER_indcpa.o MatrixVectorMul T
SABER_indcpa.o POL2MSG T
SABER_indcpa.o indcpa_kem_dec T
SABER_indcpa.o indcpa_kem_enc T
SABER_indcpa.o indcpa_kem_keypair T
SABER_indcpa.o karatsuba_simple T
SABER_indcpa.o pol_mul T
SABER_indcpa.o print_poly2 T
SABER_indcpa.o reduce T
SABER_indcpa.o toom_cook_4way T
cbd.o cbd T
fips202.o KeccakF1600_StatePermute T
fips202.o cshake128_simple T
fips202.o cshake128_simple_absorb T
fips202.o cshake128_simple_squeezeblocks T
fips202.o sha3_256 T
fips202.o sha3_512 T
fips202.o shake128 T
pack_unpack.o BS2POL T
pack_unpack.o BS2POLVEC T
pack_unpack.o BS2POLVECp T
pack_unpack.o BS2POLVECq T
pack_unpack.o POLVEC2BS T
pack_unpack.o POLVECp2BS T
pack_unpack.o POLVECq2BS T
pack_unpack.o SABER_pack_3bit T
pack_unpack.o SABER_pack_4bit T
pack_unpack.o SABER_pack_6bit T
pack_unpack.o SABER_un_pack3bit T
pack_unpack.o SABER_un_pack4bit T
pack_unpack.o SABER_un_pack6bit T
poly.o GenSecret T
verify.o cmov T
verify.o verify T
Number of similar (implementation,compiler) pairs: 1, namely:
| Implementation | Compiler |
| T:ref | gcc -march=native -mtune=native -O3 -fwrapv -fPIC -fPIE -gdwarf-4 -Wall (16.2.0) |