Test results for amd64, trident, crypto_aead/omdsha256k128n96tau96v1
[Page version: 20241027 17:25:10]
Measurements for amd64, trident, crypto_aead
Test results for amd64, trident, crypto_aead
Test results for crypto_aead/omdsha256k128n96tau96v1
Computer: trident
Microarchitecture: amd64; Core 2 65nm (6fb)
Architecture: amd64
CPU ID: GenuineIntel-000006fb-bfebfbff
SUPERCOP version: 20241022
Operation: crypto_aead
Primitive: omdsha256k128n96tau96v1
Time | Object size | Test size | Implementation | Compiler | Benchmark date | SUPERCOP version |
273516 | 16692 0 0 | 38608 780 1080 | T:ref | gcc -march=native -mtune=native -O3 -fwrapv -fPIC -fPIE -gdwarf-4 -Wall | 20240702 | 20240625 |
294538 | 8710 0 0 | 31072 812 1016 | T:ref | clang -mcpu=native -O3 -fwrapv -Qunused-arguments -fPIC -fPIE -gdwarf-4 -Wall | 20240702 | 20240625 |
296457 | 11182 0 0 | 32512 812 1016 | T:ref | clang -march=native -O2 -fwrapv -Qunused-arguments -fPIC -fPIE -gdwarf-4 -Wall | 20240702 | 20240625 |
302392 | 9096 0 0 | 31632 812 1016 | T:ref | clang -march=native -O3 -fwrapv -Qunused-arguments -fPIC -fPIE -gdwarf-4 -Wall | 20240702 | 20240625 |
316051 | 4963 0 0 | 24422 804 1016 | T:ref | clang -march=native -Os -fwrapv -Qunused-arguments -fPIC -fPIE -gdwarf-4 -Wall | 20240702 | 20240625 |
328923 | 6162 0 0 | 26575 772 1080 | T:ref | gcc -march=native -mtune=native -O -fwrapv -fPIC -fPIE -gdwarf-4 -Wall | 20240702 | 20240625 |
334767 | 7347 0 0 | 28288 780 1080 | T:ref | gcc -march=native -mtune=native -O2 -fwrapv -fPIC -fPIE -gdwarf-4 -Wall | 20240702 | 20240625 |
347363 | 4689 0 0 | 24606 804 1016 | T:ref | clang -march=native -O -fwrapv -Qunused-arguments -fPIC -fPIE -gdwarf-4 -Wall | 20240702 | 20240625 |
363167 | 4006 0 0 | 22835 756 1048 | T:ref | gcc -march=native -mtune=native -Os -fwrapv -fPIC -fPIE -gdwarf-4 -Wall | 20240702 | 20240625 |
Compiler output
try.c: /usr/bin/ld: libcrypto_aead_omdsha256k128n96tau96v1.a(omdsha256.o):.../supercop-data/trident/amd64/try/c/clang_-march=native_-O2_-fwrapv_-Qunused-arguments_-fPIC_-fPIE_-gdwarf-4_-Wall/timingleaks/crypto_aead/omdsha256k128n96tau96v1/avx1/work/./omdsha256.h:137: multiple definition of `Hash'; libcrypto_aead_omdsha256k128n96tau96v1.a(encrypt.o):.../supercop-data/trident/amd64/try/c/clang_-march=native_-O2_-fwrapv_-Qunused-arguments_-fPIC_-fPIE_-gdwarf-4_-Wall/timingleaks/crypto_aead/omdsha256k128n96tau96v1/avx1/work/./omdsha256.h:137: first defined here
try.c: clang: error: linker command failed with exit code 1 (use -v to see invocation)
Number of similar (implementation,compiler) pairs: 1, namely:
Implementation | Compiler |
T:avx1 | clang -march=native -O2 -fwrapv -Qunused-arguments -fPIC -fPIE -gdwarf-4 -Wall (Debian_Clang_11.0.1) |
Compiler output
try.c: /usr/bin/ld: libcrypto_aead_omdsha256k128n96tau96v1.a(omdsha256.o):.../supercop-data/trident/amd64/try/c/clang_-march=native_-O3_-fwrapv_-Qunused-arguments_-fPIC_-fPIE_-gdwarf-4_-Wall/timingleaks/crypto_aead/omdsha256k128n96tau96v1/avx1/work/./omdsha256.h:137: multiple definition of `Hash'; libcrypto_aead_omdsha256k128n96tau96v1.a(encrypt.o):.../supercop-data/trident/amd64/try/c/clang_-march=native_-O3_-fwrapv_-Qunused-arguments_-fPIC_-fPIE_-gdwarf-4_-Wall/timingleaks/crypto_aead/omdsha256k128n96tau96v1/avx1/work/./omdsha256.h:137: first defined here
try.c: clang: error: linker command failed with exit code 1 (use -v to see invocation)
Number of similar (implementation,compiler) pairs: 1, namely:
Implementation | Compiler |
T:avx1 | clang -march=native -O3 -fwrapv -Qunused-arguments -fPIC -fPIE -gdwarf-4 -Wall (Debian_Clang_11.0.1) |
Compiler output
try.c: /usr/bin/ld: libcrypto_aead_omdsha256k128n96tau96v1.a(omdsha256.o):.../supercop-data/trident/amd64/try/c/clang_-march=native_-O_-fwrapv_-Qunused-arguments_-fPIC_-fPIE_-gdwarf-4_-Wall/timingleaks/crypto_aead/omdsha256k128n96tau96v1/avx1/work/./omdsha256.h:137: multiple definition of `Hash'; libcrypto_aead_omdsha256k128n96tau96v1.a(encrypt.o):.../supercop-data/trident/amd64/try/c/clang_-march=native_-O_-fwrapv_-Qunused-arguments_-fPIC_-fPIE_-gdwarf-4_-Wall/timingleaks/crypto_aead/omdsha256k128n96tau96v1/avx1/work/./omdsha256.h:137: first defined here
try.c: clang: error: linker command failed with exit code 1 (use -v to see invocation)
Number of similar (implementation,compiler) pairs: 1, namely:
Implementation | Compiler |
T:avx1 | clang -march=native -O -fwrapv -Qunused-arguments -fPIC -fPIE -gdwarf-4 -Wall (Debian_Clang_11.0.1) |
Compiler output
try.c: /usr/bin/ld: libcrypto_aead_omdsha256k128n96tau96v1.a(omdsha256.o):.../supercop-data/trident/amd64/try/c/clang_-march=native_-Os_-fwrapv_-Qunused-arguments_-fPIC_-fPIE_-gdwarf-4_-Wall/timingleaks/crypto_aead/omdsha256k128n96tau96v1/avx1/work/./omdsha256.h:137: multiple definition of `Hash'; libcrypto_aead_omdsha256k128n96tau96v1.a(encrypt.o):.../supercop-data/trident/amd64/try/c/clang_-march=native_-Os_-fwrapv_-Qunused-arguments_-fPIC_-fPIE_-gdwarf-4_-Wall/timingleaks/crypto_aead/omdsha256k128n96tau96v1/avx1/work/./omdsha256.h:137: first defined here
try.c: clang: error: linker command failed with exit code 1 (use -v to see invocation)
Number of similar (implementation,compiler) pairs: 1, namely:
Implementation | Compiler |
T:avx1 | clang -march=native -Os -fwrapv -Qunused-arguments -fPIC -fPIE -gdwarf-4 -Wall (Debian_Clang_11.0.1) |
Compiler output
try.c: /usr/bin/ld: libcrypto_aead_omdsha256k128n96tau96v1.a(omdsha256.o):.../supercop-data/trident/amd64/try/c/clang_-mcpu=native_-O3_-fwrapv_-Qunused-arguments_-fPIC_-fPIE_-gdwarf-4_-Wall/timingleaks/crypto_aead/omdsha256k128n96tau96v1/avx1/work/./omdsha256.h:137: multiple definition of `Hash'; libcrypto_aead_omdsha256k128n96tau96v1.a(encrypt.o):.../supercop-data/trident/amd64/try/c/clang_-mcpu=native_-O3_-fwrapv_-Qunused-arguments_-fPIC_-fPIE_-gdwarf-4_-Wall/timingleaks/crypto_aead/omdsha256k128n96tau96v1/avx1/work/./omdsha256.h:137: first defined here
try.c: clang: error: linker command failed with exit code 1 (use -v to see invocation)
Number of similar (implementation,compiler) pairs: 1, namely:
Implementation | Compiler |
T:avx1 | clang -mcpu=native -O3 -fwrapv -Qunused-arguments -fPIC -fPIE -gdwarf-4 -Wall (Debian_Clang_11.0.1) |
Compiler output
encrypt.c: /tmp/ccukOtsv.s: Assembler messages:
encrypt.c: /tmp/ccukOtsv.s:5268: Error: can't resolve `.data' {.data section} - `.Ltext0' {.text section}
encrypt.c: /tmp/ccukOtsv.s:5269: Error: can't resolve `.data' {.data section} - `.Ltext0' {.text section}
encrypt.c: /tmp/ccukOtsv.s:5272: Error: can't resolve `.data' {.data section} - `.Ltext0' {.text section}
encrypt.c: /tmp/ccukOtsv.s:5273: Error: can't resolve `.data' {.data section} - `.Ltext0' {.text section}
encrypt.c: /tmp/ccukOtsv.s:5289: Error: can't resolve `.data' {.data section} - `.Ltext0' {.text section}
encrypt.c: /tmp/ccukOtsv.s:5290: Error: can't resolve `.data' {.data section} - `.Ltext0' {.text section}
encrypt.c: /tmp/ccukOtsv.s:5293: Error: can't resolve `.data' {.data section} - `.Ltext0' {.text section}
encrypt.c: /tmp/ccukOtsv.s:5294: Error: can't resolve `.data' {.data section} - `.Ltext0' {.text section}
encrypt.c: /tmp/ccukOtsv.s:5297: Error: can't resolve `.data' {.data section} - `.Ltext0' {.text section}
encrypt.c: /tmp/ccukOtsv.s:5298: Error: can't resolve `.data' {.data section} - `.Ltext0' {.text section}
encrypt.c: /tmp/ccukOtsv.s:5312: Error: can't resolve `.data' {.data section} - `.Ltext0' {.text section}
encrypt.c: /tmp/ccukOtsv.s:5313: Error: can't resolve `.data' {.data section} - `.Ltext0' {.text section}
encrypt.c: /tmp/ccukOtsv.s:5316: Error: can't resolve `.data' {.data section} - `.Ltext0' {.text section}
encrypt.c: /tmp/ccukOtsv.s:5317: Error: can't resolve `.data' {.data section} - `.Ltext0' {.text section}
encrypt.c: /tmp/ccukOtsv.s:5333: Error: can't resolve `.data' {.data section} - `.Ltext0' {.text section}
encrypt.c: /tmp/ccukOtsv.s:5334: Error: can't resolve `.data' {.data section} - `.Ltext0' {.text section}
encrypt.c: /tmp/ccukOtsv.s:5337: Error: can't resolve `.data' {.data section} - `.Ltext0' {.text section}
encrypt.c: /tmp/ccukOtsv.s:5338: Error: can't resolve `.data' {.data section} - `.Ltext0' {.text section}
encrypt.c: /tmp/ccukOtsv.s:5341: Error: can't resolve `.data' {.data section} - `.Ltext0' {.text section}
encrypt.c: /tmp/ccukOtsv.s:5342: Error: can't resolve `.data' {.data section} - `.Ltext0' {.text section}
encrypt.c: /tmp/ccukOtsv.s:5360: Error: can't resolve `.data' {.data section} - `.Ltext0' {.text section}
encrypt.c: /tmp/ccukOtsv.s:5361: Error: can't resolve `.data' {.data section} - `.Ltext0' {.text section}
encrypt.c: /tmp/ccukOtsv.s:5364: Error: can't resolve `.data' {.data section} - `.Ltext0' {.text section}
encrypt.c: /tmp/ccukOtsv.s:5365: Error: can't resolve `.data' {.data section} - `.Ltext0' {.text section}
encrypt.c: ...
Number of similar (implementation,compiler) pairs: 1, namely:
Implementation | Compiler |
T:avx1 | gcc -march=native -mtune=native -O2 -fwrapv -fPIC -fPIE -gdwarf-4 -Wall (10.2.1_20210110) |
Compiler output
encrypt.c: /tmp/ccXIzQDT.s: Assembler messages:
encrypt.c: /tmp/ccXIzQDT.s:5268: Error: can't resolve `.data' {.data section} - `.Ltext0' {.text section}
encrypt.c: /tmp/ccXIzQDT.s:5269: Error: can't resolve `.data' {.data section} - `.Ltext0' {.text section}
encrypt.c: /tmp/ccXIzQDT.s:5272: Error: can't resolve `.data' {.data section} - `.Ltext0' {.text section}
encrypt.c: /tmp/ccXIzQDT.s:5273: Error: can't resolve `.data' {.data section} - `.Ltext0' {.text section}
encrypt.c: /tmp/ccXIzQDT.s:5289: Error: can't resolve `.data' {.data section} - `.Ltext0' {.text section}
encrypt.c: /tmp/ccXIzQDT.s:5290: Error: can't resolve `.data' {.data section} - `.Ltext0' {.text section}
encrypt.c: /tmp/ccXIzQDT.s:5293: Error: can't resolve `.data' {.data section} - `.Ltext0' {.text section}
encrypt.c: /tmp/ccXIzQDT.s:5294: Error: can't resolve `.data' {.data section} - `.Ltext0' {.text section}
encrypt.c: /tmp/ccXIzQDT.s:5297: Error: can't resolve `.data' {.data section} - `.Ltext0' {.text section}
encrypt.c: /tmp/ccXIzQDT.s:5298: Error: can't resolve `.data' {.data section} - `.Ltext0' {.text section}
encrypt.c: /tmp/ccXIzQDT.s:5312: Error: can't resolve `.data' {.data section} - `.Ltext0' {.text section}
encrypt.c: /tmp/ccXIzQDT.s:5313: Error: can't resolve `.data' {.data section} - `.Ltext0' {.text section}
encrypt.c: /tmp/ccXIzQDT.s:5316: Error: can't resolve `.data' {.data section} - `.Ltext0' {.text section}
encrypt.c: /tmp/ccXIzQDT.s:5317: Error: can't resolve `.data' {.data section} - `.Ltext0' {.text section}
encrypt.c: /tmp/ccXIzQDT.s:5333: Error: can't resolve `.data' {.data section} - `.Ltext0' {.text section}
encrypt.c: /tmp/ccXIzQDT.s:5334: Error: can't resolve `.data' {.data section} - `.Ltext0' {.text section}
encrypt.c: /tmp/ccXIzQDT.s:5337: Error: can't resolve `.data' {.data section} - `.Ltext0' {.text section}
encrypt.c: /tmp/ccXIzQDT.s:5338: Error: can't resolve `.data' {.data section} - `.Ltext0' {.text section}
encrypt.c: /tmp/ccXIzQDT.s:5341: Error: can't resolve `.data' {.data section} - `.Ltext0' {.text section}
encrypt.c: /tmp/ccXIzQDT.s:5342: Error: can't resolve `.data' {.data section} - `.Ltext0' {.text section}
encrypt.c: /tmp/ccXIzQDT.s:5360: Error: can't resolve `.data' {.data section} - `.Ltext0' {.text section}
encrypt.c: /tmp/ccXIzQDT.s:5361: Error: can't resolve `.data' {.data section} - `.Ltext0' {.text section}
encrypt.c: /tmp/ccXIzQDT.s:5364: Error: can't resolve `.data' {.data section} - `.Ltext0' {.text section}
encrypt.c: /tmp/ccXIzQDT.s:5365: Error: can't resolve `.data' {.data section} - `.Ltext0' {.text section}
encrypt.c: ...
Number of similar (implementation,compiler) pairs: 1, namely:
Implementation | Compiler |
T:avx1 | gcc -march=native -mtune=native -O3 -fwrapv -fPIC -fPIE -gdwarf-4 -Wall (10.2.1_20210110) |
Compiler output
encrypt.c: /tmp/ccodbUhd.s: Assembler messages:
encrypt.c: /tmp/ccodbUhd.s:5261: Error: can't resolve `.data' {.data section} - `.Ltext0' {.text section}
encrypt.c: /tmp/ccodbUhd.s:5262: Error: can't resolve `.data' {.data section} - `.Ltext0' {.text section}
encrypt.c: /tmp/ccodbUhd.s:5265: Error: can't resolve `.data' {.data section} - `.Ltext0' {.text section}
encrypt.c: /tmp/ccodbUhd.s:5266: Error: can't resolve `.data' {.data section} - `.Ltext0' {.text section}
encrypt.c: /tmp/ccodbUhd.s:5282: Error: can't resolve `.data' {.data section} - `.Ltext0' {.text section}
encrypt.c: /tmp/ccodbUhd.s:5283: Error: can't resolve `.data' {.data section} - `.Ltext0' {.text section}
encrypt.c: /tmp/ccodbUhd.s:5286: Error: can't resolve `.data' {.data section} - `.Ltext0' {.text section}
encrypt.c: /tmp/ccodbUhd.s:5287: Error: can't resolve `.data' {.data section} - `.Ltext0' {.text section}
encrypt.c: /tmp/ccodbUhd.s:5290: Error: can't resolve `.data' {.data section} - `.Ltext0' {.text section}
encrypt.c: /tmp/ccodbUhd.s:5291: Error: can't resolve `.data' {.data section} - `.Ltext0' {.text section}
encrypt.c: /tmp/ccodbUhd.s:5305: Error: can't resolve `.data' {.data section} - `.Ltext0' {.text section}
encrypt.c: /tmp/ccodbUhd.s:5306: Error: can't resolve `.data' {.data section} - `.Ltext0' {.text section}
encrypt.c: /tmp/ccodbUhd.s:5309: Error: can't resolve `.data' {.data section} - `.Ltext0' {.text section}
encrypt.c: /tmp/ccodbUhd.s:5310: Error: can't resolve `.data' {.data section} - `.Ltext0' {.text section}
encrypt.c: /tmp/ccodbUhd.s:5326: Error: can't resolve `.data' {.data section} - `.Ltext0' {.text section}
encrypt.c: /tmp/ccodbUhd.s:5327: Error: can't resolve `.data' {.data section} - `.Ltext0' {.text section}
encrypt.c: /tmp/ccodbUhd.s:5330: Error: can't resolve `.data' {.data section} - `.Ltext0' {.text section}
encrypt.c: /tmp/ccodbUhd.s:5331: Error: can't resolve `.data' {.data section} - `.Ltext0' {.text section}
encrypt.c: /tmp/ccodbUhd.s:5334: Error: can't resolve `.data' {.data section} - `.Ltext0' {.text section}
encrypt.c: /tmp/ccodbUhd.s:5335: Error: can't resolve `.data' {.data section} - `.Ltext0' {.text section}
encrypt.c: /tmp/ccodbUhd.s:5353: Error: can't resolve `.data' {.data section} - `.Ltext0' {.text section}
encrypt.c: /tmp/ccodbUhd.s:5354: Error: can't resolve `.data' {.data section} - `.Ltext0' {.text section}
encrypt.c: /tmp/ccodbUhd.s:5357: Error: can't resolve `.data' {.data section} - `.Ltext0' {.text section}
encrypt.c: /tmp/ccodbUhd.s:5358: Error: can't resolve `.data' {.data section} - `.Ltext0' {.text section}
encrypt.c: ...
Number of similar (implementation,compiler) pairs: 1, namely:
Implementation | Compiler |
T:avx1 | gcc -march=native -mtune=native -O -fwrapv -fPIC -fPIE -gdwarf-4 -Wall (10.2.1_20210110) |
Compiler output
encrypt.c: /tmp/ccB7LPbG.s: Assembler messages:
encrypt.c: /tmp/ccB7LPbG.s:5266: Error: can't resolve `.data' {.data section} - `.Ltext0' {.text section}
encrypt.c: /tmp/ccB7LPbG.s:5267: Error: can't resolve `.data' {.data section} - `.Ltext0' {.text section}
encrypt.c: /tmp/ccB7LPbG.s:5270: Error: can't resolve `.data' {.data section} - `.Ltext0' {.text section}
encrypt.c: /tmp/ccB7LPbG.s:5271: Error: can't resolve `.data' {.data section} - `.Ltext0' {.text section}
encrypt.c: /tmp/ccB7LPbG.s:5287: Error: can't resolve `.data' {.data section} - `.Ltext0' {.text section}
encrypt.c: /tmp/ccB7LPbG.s:5288: Error: can't resolve `.data' {.data section} - `.Ltext0' {.text section}
encrypt.c: /tmp/ccB7LPbG.s:5291: Error: can't resolve `.data' {.data section} - `.Ltext0' {.text section}
encrypt.c: /tmp/ccB7LPbG.s:5292: Error: can't resolve `.data' {.data section} - `.Ltext0' {.text section}
encrypt.c: /tmp/ccB7LPbG.s:5295: Error: can't resolve `.data' {.data section} - `.Ltext0' {.text section}
encrypt.c: /tmp/ccB7LPbG.s:5296: Error: can't resolve `.data' {.data section} - `.Ltext0' {.text section}
encrypt.c: /tmp/ccB7LPbG.s:5310: Error: can't resolve `.data' {.data section} - `.Ltext0' {.text section}
encrypt.c: /tmp/ccB7LPbG.s:5311: Error: can't resolve `.data' {.data section} - `.Ltext0' {.text section}
encrypt.c: /tmp/ccB7LPbG.s:5314: Error: can't resolve `.data' {.data section} - `.Ltext0' {.text section}
encrypt.c: /tmp/ccB7LPbG.s:5315: Error: can't resolve `.data' {.data section} - `.Ltext0' {.text section}
encrypt.c: /tmp/ccB7LPbG.s:5331: Error: can't resolve `.data' {.data section} - `.Ltext0' {.text section}
encrypt.c: /tmp/ccB7LPbG.s:5332: Error: can't resolve `.data' {.data section} - `.Ltext0' {.text section}
encrypt.c: /tmp/ccB7LPbG.s:5335: Error: can't resolve `.data' {.data section} - `.Ltext0' {.text section}
encrypt.c: /tmp/ccB7LPbG.s:5336: Error: can't resolve `.data' {.data section} - `.Ltext0' {.text section}
encrypt.c: /tmp/ccB7LPbG.s:5339: Error: can't resolve `.data' {.data section} - `.Ltext0' {.text section}
encrypt.c: /tmp/ccB7LPbG.s:5340: Error: can't resolve `.data' {.data section} - `.Ltext0' {.text section}
encrypt.c: /tmp/ccB7LPbG.s:5358: Error: can't resolve `.data' {.data section} - `.Ltext0' {.text section}
encrypt.c: /tmp/ccB7LPbG.s:5359: Error: can't resolve `.data' {.data section} - `.Ltext0' {.text section}
encrypt.c: /tmp/ccB7LPbG.s:5362: Error: can't resolve `.data' {.data section} - `.Ltext0' {.text section}
encrypt.c: /tmp/ccB7LPbG.s:5363: Error: can't resolve `.data' {.data section} - `.Ltext0' {.text section}
encrypt.c: ...
Number of similar (implementation,compiler) pairs: 1, namely:
Implementation | Compiler |
T:avx1 | gcc -march=native -mtune=native -Os -fwrapv -fPIC -fPIE -gdwarf-4 -Wall (10.2.1_20210110) |
Compiler output
try.c: /usr/bin/ld: libcrypto_aead_omdsha256k128n96tau96v1.a(omdsha256.o):.../supercop-data/trident/amd64/try/c/clang_-march=native_-O2_-fwrapv_-Qunused-arguments_-fPIC_-fPIE_-gdwarf-4_-Wall/timingleaks/crypto_aead/omdsha256k128n96tau96v1/sse4/work/./omdsha256.h:137: multiple definition of `Hash'; libcrypto_aead_omdsha256k128n96tau96v1.a(encrypt.o):.../supercop-data/trident/amd64/try/c/clang_-march=native_-O2_-fwrapv_-Qunused-arguments_-fPIC_-fPIE_-gdwarf-4_-Wall/timingleaks/crypto_aead/omdsha256k128n96tau96v1/sse4/work/./omdsha256.h:137: first defined here
try.c: clang: error: linker command failed with exit code 1 (use -v to see invocation)
Number of similar (implementation,compiler) pairs: 1, namely:
Implementation | Compiler |
T:sse4 | clang -march=native -O2 -fwrapv -Qunused-arguments -fPIC -fPIE -gdwarf-4 -Wall (Debian_Clang_11.0.1) |
Compiler output
try.c: /usr/bin/ld: libcrypto_aead_omdsha256k128n96tau96v1.a(omdsha256.o):.../supercop-data/trident/amd64/try/c/clang_-march=native_-O3_-fwrapv_-Qunused-arguments_-fPIC_-fPIE_-gdwarf-4_-Wall/timingleaks/crypto_aead/omdsha256k128n96tau96v1/sse4/work/./omdsha256.h:137: multiple definition of `Hash'; libcrypto_aead_omdsha256k128n96tau96v1.a(encrypt.o):.../supercop-data/trident/amd64/try/c/clang_-march=native_-O3_-fwrapv_-Qunused-arguments_-fPIC_-fPIE_-gdwarf-4_-Wall/timingleaks/crypto_aead/omdsha256k128n96tau96v1/sse4/work/./omdsha256.h:137: first defined here
try.c: clang: error: linker command failed with exit code 1 (use -v to see invocation)
Number of similar (implementation,compiler) pairs: 1, namely:
Implementation | Compiler |
T:sse4 | clang -march=native -O3 -fwrapv -Qunused-arguments -fPIC -fPIE -gdwarf-4 -Wall (Debian_Clang_11.0.1) |
Compiler output
try.c: /usr/bin/ld: libcrypto_aead_omdsha256k128n96tau96v1.a(omdsha256.o):.../supercop-data/trident/amd64/try/c/clang_-march=native_-O_-fwrapv_-Qunused-arguments_-fPIC_-fPIE_-gdwarf-4_-Wall/timingleaks/crypto_aead/omdsha256k128n96tau96v1/sse4/work/./omdsha256.h:137: multiple definition of `Hash'; libcrypto_aead_omdsha256k128n96tau96v1.a(encrypt.o):.../supercop-data/trident/amd64/try/c/clang_-march=native_-O_-fwrapv_-Qunused-arguments_-fPIC_-fPIE_-gdwarf-4_-Wall/timingleaks/crypto_aead/omdsha256k128n96tau96v1/sse4/work/./omdsha256.h:137: first defined here
try.c: clang: error: linker command failed with exit code 1 (use -v to see invocation)
Number of similar (implementation,compiler) pairs: 1, namely:
Implementation | Compiler |
T:sse4 | clang -march=native -O -fwrapv -Qunused-arguments -fPIC -fPIE -gdwarf-4 -Wall (Debian_Clang_11.0.1) |
Compiler output
try.c: /usr/bin/ld: libcrypto_aead_omdsha256k128n96tau96v1.a(omdsha256.o):.../supercop-data/trident/amd64/try/c/clang_-march=native_-Os_-fwrapv_-Qunused-arguments_-fPIC_-fPIE_-gdwarf-4_-Wall/timingleaks/crypto_aead/omdsha256k128n96tau96v1/sse4/work/./omdsha256.h:137: multiple definition of `Hash'; libcrypto_aead_omdsha256k128n96tau96v1.a(encrypt.o):.../supercop-data/trident/amd64/try/c/clang_-march=native_-Os_-fwrapv_-Qunused-arguments_-fPIC_-fPIE_-gdwarf-4_-Wall/timingleaks/crypto_aead/omdsha256k128n96tau96v1/sse4/work/./omdsha256.h:137: first defined here
try.c: clang: error: linker command failed with exit code 1 (use -v to see invocation)
Number of similar (implementation,compiler) pairs: 1, namely:
Implementation | Compiler |
T:sse4 | clang -march=native -Os -fwrapv -Qunused-arguments -fPIC -fPIE -gdwarf-4 -Wall (Debian_Clang_11.0.1) |
Compiler output
try.c: /usr/bin/ld: libcrypto_aead_omdsha256k128n96tau96v1.a(omdsha256.o):.../supercop-data/trident/amd64/try/c/clang_-mcpu=native_-O3_-fwrapv_-Qunused-arguments_-fPIC_-fPIE_-gdwarf-4_-Wall/timingleaks/crypto_aead/omdsha256k128n96tau96v1/sse4/work/./omdsha256.h:137: multiple definition of `Hash'; libcrypto_aead_omdsha256k128n96tau96v1.a(encrypt.o):.../supercop-data/trident/amd64/try/c/clang_-mcpu=native_-O3_-fwrapv_-Qunused-arguments_-fPIC_-fPIE_-gdwarf-4_-Wall/timingleaks/crypto_aead/omdsha256k128n96tau96v1/sse4/work/./omdsha256.h:137: first defined here
try.c: clang: error: linker command failed with exit code 1 (use -v to see invocation)
Number of similar (implementation,compiler) pairs: 1, namely:
Implementation | Compiler |
T:sse4 | clang -mcpu=native -O3 -fwrapv -Qunused-arguments -fPIC -fPIE -gdwarf-4 -Wall (Debian_Clang_11.0.1) |
Compiler output
encrypt.c: /tmp/ccn2xlkL.s: Assembler messages:
encrypt.c: /tmp/ccn2xlkL.s:5307: Error: can't resolve `.data' {.data section} - `.Ltext0' {.text section}
encrypt.c: /tmp/ccn2xlkL.s:5308: Error: can't resolve `.data' {.data section} - `.Ltext0' {.text section}
encrypt.c: /tmp/ccn2xlkL.s:5311: Error: can't resolve `.data' {.data section} - `.Ltext0' {.text section}
encrypt.c: /tmp/ccn2xlkL.s:5312: Error: can't resolve `.data' {.data section} - `.Ltext0' {.text section}
encrypt.c: /tmp/ccn2xlkL.s:5328: Error: can't resolve `.data' {.data section} - `.Ltext0' {.text section}
encrypt.c: /tmp/ccn2xlkL.s:5329: Error: can't resolve `.data' {.data section} - `.Ltext0' {.text section}
encrypt.c: /tmp/ccn2xlkL.s:5332: Error: can't resolve `.data' {.data section} - `.Ltext0' {.text section}
encrypt.c: /tmp/ccn2xlkL.s:5333: Error: can't resolve `.data' {.data section} - `.Ltext0' {.text section}
encrypt.c: /tmp/ccn2xlkL.s:5336: Error: can't resolve `.data' {.data section} - `.Ltext0' {.text section}
encrypt.c: /tmp/ccn2xlkL.s:5337: Error: can't resolve `.data' {.data section} - `.Ltext0' {.text section}
encrypt.c: /tmp/ccn2xlkL.s:5351: Error: can't resolve `.data' {.data section} - `.Ltext0' {.text section}
encrypt.c: /tmp/ccn2xlkL.s:5352: Error: can't resolve `.data' {.data section} - `.Ltext0' {.text section}
encrypt.c: /tmp/ccn2xlkL.s:5355: Error: can't resolve `.data' {.data section} - `.Ltext0' {.text section}
encrypt.c: /tmp/ccn2xlkL.s:5356: Error: can't resolve `.data' {.data section} - `.Ltext0' {.text section}
encrypt.c: /tmp/ccn2xlkL.s:5372: Error: can't resolve `.data' {.data section} - `.Ltext0' {.text section}
encrypt.c: /tmp/ccn2xlkL.s:5373: Error: can't resolve `.data' {.data section} - `.Ltext0' {.text section}
encrypt.c: /tmp/ccn2xlkL.s:5376: Error: can't resolve `.data' {.data section} - `.Ltext0' {.text section}
encrypt.c: /tmp/ccn2xlkL.s:5377: Error: can't resolve `.data' {.data section} - `.Ltext0' {.text section}
encrypt.c: /tmp/ccn2xlkL.s:5380: Error: can't resolve `.data' {.data section} - `.Ltext0' {.text section}
encrypt.c: /tmp/ccn2xlkL.s:5381: Error: can't resolve `.data' {.data section} - `.Ltext0' {.text section}
encrypt.c: /tmp/ccn2xlkL.s:5399: Error: can't resolve `.data' {.data section} - `.Ltext0' {.text section}
encrypt.c: /tmp/ccn2xlkL.s:5400: Error: can't resolve `.data' {.data section} - `.Ltext0' {.text section}
encrypt.c: /tmp/ccn2xlkL.s:5403: Error: can't resolve `.data' {.data section} - `.Ltext0' {.text section}
encrypt.c: /tmp/ccn2xlkL.s:5404: Error: can't resolve `.data' {.data section} - `.Ltext0' {.text section}
encrypt.c: ...
Number of similar (implementation,compiler) pairs: 1, namely:
Implementation | Compiler |
T:sse4 | gcc -march=native -mtune=native -O2 -fwrapv -fPIC -fPIE -gdwarf-4 -Wall (10.2.1_20210110) |
Compiler output
encrypt.c: /tmp/ccQR1aSe.s: Assembler messages:
encrypt.c: /tmp/ccQR1aSe.s:5307: Error: can't resolve `.data' {.data section} - `.Ltext0' {.text section}
encrypt.c: /tmp/ccQR1aSe.s:5308: Error: can't resolve `.data' {.data section} - `.Ltext0' {.text section}
encrypt.c: /tmp/ccQR1aSe.s:5311: Error: can't resolve `.data' {.data section} - `.Ltext0' {.text section}
encrypt.c: /tmp/ccQR1aSe.s:5312: Error: can't resolve `.data' {.data section} - `.Ltext0' {.text section}
encrypt.c: /tmp/ccQR1aSe.s:5328: Error: can't resolve `.data' {.data section} - `.Ltext0' {.text section}
encrypt.c: /tmp/ccQR1aSe.s:5329: Error: can't resolve `.data' {.data section} - `.Ltext0' {.text section}
encrypt.c: /tmp/ccQR1aSe.s:5332: Error: can't resolve `.data' {.data section} - `.Ltext0' {.text section}
encrypt.c: /tmp/ccQR1aSe.s:5333: Error: can't resolve `.data' {.data section} - `.Ltext0' {.text section}
encrypt.c: /tmp/ccQR1aSe.s:5336: Error: can't resolve `.data' {.data section} - `.Ltext0' {.text section}
encrypt.c: /tmp/ccQR1aSe.s:5337: Error: can't resolve `.data' {.data section} - `.Ltext0' {.text section}
encrypt.c: /tmp/ccQR1aSe.s:5351: Error: can't resolve `.data' {.data section} - `.Ltext0' {.text section}
encrypt.c: /tmp/ccQR1aSe.s:5352: Error: can't resolve `.data' {.data section} - `.Ltext0' {.text section}
encrypt.c: /tmp/ccQR1aSe.s:5355: Error: can't resolve `.data' {.data section} - `.Ltext0' {.text section}
encrypt.c: /tmp/ccQR1aSe.s:5356: Error: can't resolve `.data' {.data section} - `.Ltext0' {.text section}
encrypt.c: /tmp/ccQR1aSe.s:5372: Error: can't resolve `.data' {.data section} - `.Ltext0' {.text section}
encrypt.c: /tmp/ccQR1aSe.s:5373: Error: can't resolve `.data' {.data section} - `.Ltext0' {.text section}
encrypt.c: /tmp/ccQR1aSe.s:5376: Error: can't resolve `.data' {.data section} - `.Ltext0' {.text section}
encrypt.c: /tmp/ccQR1aSe.s:5377: Error: can't resolve `.data' {.data section} - `.Ltext0' {.text section}
encrypt.c: /tmp/ccQR1aSe.s:5380: Error: can't resolve `.data' {.data section} - `.Ltext0' {.text section}
encrypt.c: /tmp/ccQR1aSe.s:5381: Error: can't resolve `.data' {.data section} - `.Ltext0' {.text section}
encrypt.c: /tmp/ccQR1aSe.s:5399: Error: can't resolve `.data' {.data section} - `.Ltext0' {.text section}
encrypt.c: /tmp/ccQR1aSe.s:5400: Error: can't resolve `.data' {.data section} - `.Ltext0' {.text section}
encrypt.c: /tmp/ccQR1aSe.s:5403: Error: can't resolve `.data' {.data section} - `.Ltext0' {.text section}
encrypt.c: /tmp/ccQR1aSe.s:5404: Error: can't resolve `.data' {.data section} - `.Ltext0' {.text section}
encrypt.c: ...
Number of similar (implementation,compiler) pairs: 1, namely:
Implementation | Compiler |
T:sse4 | gcc -march=native -mtune=native -O3 -fwrapv -fPIC -fPIE -gdwarf-4 -Wall (10.2.1_20210110) |
Compiler output
encrypt.c: /tmp/ccEwXJrE.s: Assembler messages:
encrypt.c: /tmp/ccEwXJrE.s:5300: Error: can't resolve `.data' {.data section} - `.Ltext0' {.text section}
encrypt.c: /tmp/ccEwXJrE.s:5301: Error: can't resolve `.data' {.data section} - `.Ltext0' {.text section}
encrypt.c: /tmp/ccEwXJrE.s:5304: Error: can't resolve `.data' {.data section} - `.Ltext0' {.text section}
encrypt.c: /tmp/ccEwXJrE.s:5305: Error: can't resolve `.data' {.data section} - `.Ltext0' {.text section}
encrypt.c: /tmp/ccEwXJrE.s:5321: Error: can't resolve `.data' {.data section} - `.Ltext0' {.text section}
encrypt.c: /tmp/ccEwXJrE.s:5322: Error: can't resolve `.data' {.data section} - `.Ltext0' {.text section}
encrypt.c: /tmp/ccEwXJrE.s:5325: Error: can't resolve `.data' {.data section} - `.Ltext0' {.text section}
encrypt.c: /tmp/ccEwXJrE.s:5326: Error: can't resolve `.data' {.data section} - `.Ltext0' {.text section}
encrypt.c: /tmp/ccEwXJrE.s:5329: Error: can't resolve `.data' {.data section} - `.Ltext0' {.text section}
encrypt.c: /tmp/ccEwXJrE.s:5330: Error: can't resolve `.data' {.data section} - `.Ltext0' {.text section}
encrypt.c: /tmp/ccEwXJrE.s:5344: Error: can't resolve `.data' {.data section} - `.Ltext0' {.text section}
encrypt.c: /tmp/ccEwXJrE.s:5345: Error: can't resolve `.data' {.data section} - `.Ltext0' {.text section}
encrypt.c: /tmp/ccEwXJrE.s:5348: Error: can't resolve `.data' {.data section} - `.Ltext0' {.text section}
encrypt.c: /tmp/ccEwXJrE.s:5349: Error: can't resolve `.data' {.data section} - `.Ltext0' {.text section}
encrypt.c: /tmp/ccEwXJrE.s:5365: Error: can't resolve `.data' {.data section} - `.Ltext0' {.text section}
encrypt.c: /tmp/ccEwXJrE.s:5366: Error: can't resolve `.data' {.data section} - `.Ltext0' {.text section}
encrypt.c: /tmp/ccEwXJrE.s:5369: Error: can't resolve `.data' {.data section} - `.Ltext0' {.text section}
encrypt.c: /tmp/ccEwXJrE.s:5370: Error: can't resolve `.data' {.data section} - `.Ltext0' {.text section}
encrypt.c: /tmp/ccEwXJrE.s:5373: Error: can't resolve `.data' {.data section} - `.Ltext0' {.text section}
encrypt.c: /tmp/ccEwXJrE.s:5374: Error: can't resolve `.data' {.data section} - `.Ltext0' {.text section}
encrypt.c: /tmp/ccEwXJrE.s:5392: Error: can't resolve `.data' {.data section} - `.Ltext0' {.text section}
encrypt.c: /tmp/ccEwXJrE.s:5393: Error: can't resolve `.data' {.data section} - `.Ltext0' {.text section}
encrypt.c: /tmp/ccEwXJrE.s:5396: Error: can't resolve `.data' {.data section} - `.Ltext0' {.text section}
encrypt.c: /tmp/ccEwXJrE.s:5397: Error: can't resolve `.data' {.data section} - `.Ltext0' {.text section}
encrypt.c: ...
Number of similar (implementation,compiler) pairs: 1, namely:
Implementation | Compiler |
T:sse4 | gcc -march=native -mtune=native -O -fwrapv -fPIC -fPIE -gdwarf-4 -Wall (10.2.1_20210110) |
Compiler output
encrypt.c: /tmp/cc33nECn.s: Assembler messages:
encrypt.c: /tmp/cc33nECn.s:5305: Error: can't resolve `.data' {.data section} - `.Ltext0' {.text section}
encrypt.c: /tmp/cc33nECn.s:5306: Error: can't resolve `.data' {.data section} - `.Ltext0' {.text section}
encrypt.c: /tmp/cc33nECn.s:5309: Error: can't resolve `.data' {.data section} - `.Ltext0' {.text section}
encrypt.c: /tmp/cc33nECn.s:5310: Error: can't resolve `.data' {.data section} - `.Ltext0' {.text section}
encrypt.c: /tmp/cc33nECn.s:5326: Error: can't resolve `.data' {.data section} - `.Ltext0' {.text section}
encrypt.c: /tmp/cc33nECn.s:5327: Error: can't resolve `.data' {.data section} - `.Ltext0' {.text section}
encrypt.c: /tmp/cc33nECn.s:5330: Error: can't resolve `.data' {.data section} - `.Ltext0' {.text section}
encrypt.c: /tmp/cc33nECn.s:5331: Error: can't resolve `.data' {.data section} - `.Ltext0' {.text section}
encrypt.c: /tmp/cc33nECn.s:5334: Error: can't resolve `.data' {.data section} - `.Ltext0' {.text section}
encrypt.c: /tmp/cc33nECn.s:5335: Error: can't resolve `.data' {.data section} - `.Ltext0' {.text section}
encrypt.c: /tmp/cc33nECn.s:5349: Error: can't resolve `.data' {.data section} - `.Ltext0' {.text section}
encrypt.c: /tmp/cc33nECn.s:5350: Error: can't resolve `.data' {.data section} - `.Ltext0' {.text section}
encrypt.c: /tmp/cc33nECn.s:5353: Error: can't resolve `.data' {.data section} - `.Ltext0' {.text section}
encrypt.c: /tmp/cc33nECn.s:5354: Error: can't resolve `.data' {.data section} - `.Ltext0' {.text section}
encrypt.c: /tmp/cc33nECn.s:5370: Error: can't resolve `.data' {.data section} - `.Ltext0' {.text section}
encrypt.c: /tmp/cc33nECn.s:5371: Error: can't resolve `.data' {.data section} - `.Ltext0' {.text section}
encrypt.c: /tmp/cc33nECn.s:5374: Error: can't resolve `.data' {.data section} - `.Ltext0' {.text section}
encrypt.c: /tmp/cc33nECn.s:5375: Error: can't resolve `.data' {.data section} - `.Ltext0' {.text section}
encrypt.c: /tmp/cc33nECn.s:5378: Error: can't resolve `.data' {.data section} - `.Ltext0' {.text section}
encrypt.c: /tmp/cc33nECn.s:5379: Error: can't resolve `.data' {.data section} - `.Ltext0' {.text section}
encrypt.c: /tmp/cc33nECn.s:5397: Error: can't resolve `.data' {.data section} - `.Ltext0' {.text section}
encrypt.c: /tmp/cc33nECn.s:5398: Error: can't resolve `.data' {.data section} - `.Ltext0' {.text section}
encrypt.c: /tmp/cc33nECn.s:5401: Error: can't resolve `.data' {.data section} - `.Ltext0' {.text section}
encrypt.c: /tmp/cc33nECn.s:5402: Error: can't resolve `.data' {.data section} - `.Ltext0' {.text section}
encrypt.c: ...
Number of similar (implementation,compiler) pairs: 1, namely:
Implementation | Compiler |
T:sse4 | gcc -march=native -mtune=native -Os -fwrapv -fPIC -fPIE -gdwarf-4 -Wall (10.2.1_20210110) |