Test results for amd64, thinksky, crypto_aead/omdsha512k128n128tau128v1
[Page version: 20261028 01:16:00]
Measurements for amd64, thinksky, crypto_aead
Test results for amd64, thinksky, crypto_aead
Test results for crypto_aead/omdsha512k128n128tau128v1
Computer: thinksky
Microarchitecture: amd64; Skylake (506e3)
Architecture: amd64
CPU ID: GenuineIntel-000506e3-bfebfbff
SUPERCOP version: 20261018
Operation: crypto_aead
Primitive: omdsha512k128n128tau128v1
| Time | Object size | Test size | Implementation | Compiler | Benchmark date | SUPERCOP version |
| 114840 | 18653 0 0 | 52727 1232 1720 | T:ref | gcc -march=native -mtune=native -O3 -fwrapv -fPIC -fPIE -gdwarf-4 -Wall | 20261019 | 20261018 |
| 117579 | 21279 0 0 | 55316 1272 1688 | T:ref | clang -march=native -O3 -fwrapv -Qunused-arguments -fPIC -fPIE -gdwarf-4 -Wall | 20261019 | 20261018 |
| 118020 | 17154 0 0 | 51260 1272 1688 | T:ref | clang -march=native -O2 -fwrapv -Qunused-arguments -fPIC -fPIE -gdwarf-4 -Wall | 20261019 | 20261018 |
| 132293 | 7087 0 0 | 38775 1232 1720 | T:ref | gcc -march=native -mtune=native -O2 -fwrapv -fPIC -fPIE -gdwarf-4 -Wall | 20261019 | 20261018 |
| 133720 | 5384 0 0 | 36538 1264 1688 | T:ref | clang -march=native -Os -fwrapv -Qunused-arguments -fPIC -fPIE -gdwarf-4 -Wall | 20261019 | 20261018 |
| 135829 | 25235 0 0 | 58432 1272 1624 | T:ref | clang -mcpu=native -O3 -fwrapv -Qunused-arguments -fPIC -fPIE -gdwarf-4 -Wall | 20261019 | 20261018 |
| 140738 | 6747 0 0 | 37224 1272 1624 | T:ref | clang -march=native -O -fwrapv -Qunused-arguments -fPIC -fPIE -gdwarf-4 -Wall | 20261019 | 20261018 |
| 148266 | 6296 0 0 | 37470 1224 1720 | T:ref | gcc -march=native -mtune=native -O -fwrapv -fPIC -fPIE -gdwarf-4 -Wall | 20261019 | 20261018 |
| 177648 | 4747 0 0 | 33986 1208 1688 | T:ref | gcc -march=native -mtune=native -Os -fwrapv -fPIC -fPIE -gdwarf-4 -Wall | 20261019 | 20261018 |
Compiler output
try.c: /usr/bin/ld: libcrypto_aead_omdsha512k128n128tau128v1.a(omdsha512.o):.../supercop-data/thinksky/amd64/try/c/clang_-march=native_-O2_-fwrapv_-Qunused-arguments_-fPIC_-fPIE_-gdwarf-4_-Wall/timingleaks/crypto_aead/omdsha512k128n128tau128v1/avx1/work/./omdsha512.h:146: multiple definition of `Hash'; libcrypto_aead_omdsha512k128n128tau128v1.a(encrypt.o):.../supercop-data/thinksky/amd64/try/c/clang_-march=native_-O2_-fwrapv_-Qunused-arguments_-fPIC_-fPIE_-gdwarf-4_-Wall/timingleaks/crypto_aead/omdsha512k128n128tau128v1/avx1/work/./omdsha512.h:146: first defined here
try.c: clang: error: linker command failed with exit code 1 (use -v to see invocation)
Number of similar (implementation,compiler) pairs: 1, namely:
| Implementation | Compiler |
| T:avx1 | clang -march=native -O2 -fwrapv -Qunused-arguments -fPIC -fPIE -gdwarf-4 -Wall (Debian_Clang_19.1.7_(3+b1)) |
Compiler output
try.c: /usr/bin/ld: libcrypto_aead_omdsha512k128n128tau128v1.a(omdsha512.o):.../supercop-data/thinksky/amd64/try/c/clang_-march=native_-O3_-fwrapv_-Qunused-arguments_-fPIC_-fPIE_-gdwarf-4_-Wall/timingleaks/crypto_aead/omdsha512k128n128tau128v1/avx1/work/./omdsha512.h:146: multiple definition of `Hash'; libcrypto_aead_omdsha512k128n128tau128v1.a(encrypt.o):.../supercop-data/thinksky/amd64/try/c/clang_-march=native_-O3_-fwrapv_-Qunused-arguments_-fPIC_-fPIE_-gdwarf-4_-Wall/timingleaks/crypto_aead/omdsha512k128n128tau128v1/avx1/work/./omdsha512.h:146: first defined here
try.c: clang: error: linker command failed with exit code 1 (use -v to see invocation)
Number of similar (implementation,compiler) pairs: 1, namely:
| Implementation | Compiler |
| T:avx1 | clang -march=native -O3 -fwrapv -Qunused-arguments -fPIC -fPIE -gdwarf-4 -Wall (Debian_Clang_19.1.7_(3+b1)) |
Compiler output
try.c: /usr/bin/ld: libcrypto_aead_omdsha512k128n128tau128v1.a(omdsha512.o):.../supercop-data/thinksky/amd64/try/c/clang_-march=native_-O_-fwrapv_-Qunused-arguments_-fPIC_-fPIE_-gdwarf-4_-Wall/timingleaks/crypto_aead/omdsha512k128n128tau128v1/avx1/work/./omdsha512.h:146: multiple definition of `Hash'; libcrypto_aead_omdsha512k128n128tau128v1.a(encrypt.o):.../supercop-data/thinksky/amd64/try/c/clang_-march=native_-O_-fwrapv_-Qunused-arguments_-fPIC_-fPIE_-gdwarf-4_-Wall/timingleaks/crypto_aead/omdsha512k128n128tau128v1/avx1/work/./omdsha512.h:146: first defined here
try.c: clang: error: linker command failed with exit code 1 (use -v to see invocation)
Number of similar (implementation,compiler) pairs: 1, namely:
| Implementation | Compiler |
| T:avx1 | clang -march=native -O -fwrapv -Qunused-arguments -fPIC -fPIE -gdwarf-4 -Wall (Debian_Clang_19.1.7_(3+b1)) |
Compiler output
try.c: /usr/bin/ld: libcrypto_aead_omdsha512k128n128tau128v1.a(omdsha512.o):.../supercop-data/thinksky/amd64/try/c/clang_-march=native_-Os_-fwrapv_-Qunused-arguments_-fPIC_-fPIE_-gdwarf-4_-Wall/timingleaks/crypto_aead/omdsha512k128n128tau128v1/avx1/work/./omdsha512.h:146: multiple definition of `Hash'; libcrypto_aead_omdsha512k128n128tau128v1.a(encrypt.o):.../supercop-data/thinksky/amd64/try/c/clang_-march=native_-Os_-fwrapv_-Qunused-arguments_-fPIC_-fPIE_-gdwarf-4_-Wall/timingleaks/crypto_aead/omdsha512k128n128tau128v1/avx1/work/./omdsha512.h:146: first defined here
try.c: clang: error: linker command failed with exit code 1 (use -v to see invocation)
Number of similar (implementation,compiler) pairs: 1, namely:
| Implementation | Compiler |
| T:avx1 | clang -march=native -Os -fwrapv -Qunused-arguments -fPIC -fPIE -gdwarf-4 -Wall (Debian_Clang_19.1.7_(3+b1)) |
Compiler output
try.c: /usr/bin/ld: libcrypto_aead_omdsha512k128n128tau128v1.a(omdsha512.o):.../supercop-data/thinksky/amd64/try/c/clang_-mcpu=native_-O3_-fwrapv_-Qunused-arguments_-fPIC_-fPIE_-gdwarf-4_-Wall/timingleaks/crypto_aead/omdsha512k128n128tau128v1/avx1/work/./omdsha512.h:146: multiple definition of `Hash'; libcrypto_aead_omdsha512k128n128tau128v1.a(encrypt.o):.../supercop-data/thinksky/amd64/try/c/clang_-mcpu=native_-O3_-fwrapv_-Qunused-arguments_-fPIC_-fPIE_-gdwarf-4_-Wall/timingleaks/crypto_aead/omdsha512k128n128tau128v1/avx1/work/./omdsha512.h:146: first defined here
try.c: clang: error: linker command failed with exit code 1 (use -v to see invocation)
Number of similar (implementation,compiler) pairs: 1, namely:
| Implementation | Compiler |
| T:avx1 | clang -mcpu=native -O3 -fwrapv -Qunused-arguments -fPIC -fPIE -gdwarf-4 -Wall (Debian_Clang_19.1.7_(3+b1)) |
Compiler output
encrypt.c: /tmp/ccxjprAz.s: Assembler messages:
encrypt.c: /tmp/ccxjprAz.s:3548: Warning: dwarf line number information for .data ignored
encrypt.c: /tmp/ccxjprAz.s:3550: Warning: dwarf line number information for .data ignored
encrypt.c: /tmp/ccxjprAz.s:3551: Warning: dwarf line number information for .data ignored
encrypt.c: /tmp/ccxjprAz.s:3552: Warning: dwarf line number information for .data ignored
encrypt.c: /tmp/ccxjprAz.s:3554: Warning: dwarf line number information for .data ignored
encrypt.c: /tmp/ccxjprAz.s:3556: Warning: dwarf line number information for .data ignored
encrypt.c: /tmp/ccxjprAz.s:3558: Warning: dwarf line number information for .data ignored
encrypt.c: /tmp/ccxjprAz.s:3559: Warning: dwarf line number information for .data ignored
encrypt.c: /tmp/ccxjprAz.s:3562: Warning: dwarf line number information for .data ignored
encrypt.c: /tmp/ccxjprAz.s:3565: Warning: dwarf line number information for .data ignored
encrypt.c: /tmp/ccxjprAz.s:3568: Warning: dwarf line number information for .data ignored
encrypt.c: /tmp/ccxjprAz.s:3571: Warning: dwarf line number information for .data ignored
encrypt.c: /tmp/ccxjprAz.s:3581: Warning: dwarf line number information for .data ignored
encrypt.c: /tmp/ccxjprAz.s:3583: Warning: dwarf line number information for .data ignored
encrypt.c: /tmp/ccxjprAz.s:3584: Warning: dwarf line number information for .data ignored
encrypt.c: /tmp/ccxjprAz.s:3585: Warning: dwarf line number information for .data ignored
encrypt.c: /tmp/ccxjprAz.s:3588: Warning: dwarf line number information for .data ignored
encrypt.c: /tmp/ccxjprAz.s:3591: Warning: dwarf line number information for .data ignored
encrypt.c: /tmp/ccxjprAz.s:3595: Warning: dwarf line number information for .data ignored
encrypt.c: /tmp/ccxjprAz.s:3597: Warning: dwarf line number information for .data ignored
encrypt.c: /tmp/ccxjprAz.s:3600: Warning: dwarf line number information for .data ignored
encrypt.c: /tmp/ccxjprAz.s:3602: Warning: dwarf line number information for .data ignored
encrypt.c: /tmp/ccxjprAz.s:3603: Warning: dwarf line number information for .data ignored
encrypt.c: /tmp/ccxjprAz.s:3606: Warning: dwarf line number information for .data ignored
encrypt.c: ...
Number of similar (implementation,compiler) pairs: 1, namely:
| Implementation | Compiler |
| T:avx1 | gcc -march=native -mtune=native -O2 -fwrapv -fPIC -fPIE -gdwarf-4 -Wall (14.2.0) |
Compiler output
encrypt.c: /tmp/ccRXkkwA.s: Assembler messages:
encrypt.c: /tmp/ccRXkkwA.s:3548: Warning: dwarf line number information for .data ignored
encrypt.c: /tmp/ccRXkkwA.s:3550: Warning: dwarf line number information for .data ignored
encrypt.c: /tmp/ccRXkkwA.s:3551: Warning: dwarf line number information for .data ignored
encrypt.c: /tmp/ccRXkkwA.s:3552: Warning: dwarf line number information for .data ignored
encrypt.c: /tmp/ccRXkkwA.s:3554: Warning: dwarf line number information for .data ignored
encrypt.c: /tmp/ccRXkkwA.s:3556: Warning: dwarf line number information for .data ignored
encrypt.c: /tmp/ccRXkkwA.s:3558: Warning: dwarf line number information for .data ignored
encrypt.c: /tmp/ccRXkkwA.s:3559: Warning: dwarf line number information for .data ignored
encrypt.c: /tmp/ccRXkkwA.s:3562: Warning: dwarf line number information for .data ignored
encrypt.c: /tmp/ccRXkkwA.s:3565: Warning: dwarf line number information for .data ignored
encrypt.c: /tmp/ccRXkkwA.s:3568: Warning: dwarf line number information for .data ignored
encrypt.c: /tmp/ccRXkkwA.s:3571: Warning: dwarf line number information for .data ignored
encrypt.c: /tmp/ccRXkkwA.s:3581: Warning: dwarf line number information for .data ignored
encrypt.c: /tmp/ccRXkkwA.s:3583: Warning: dwarf line number information for .data ignored
encrypt.c: /tmp/ccRXkkwA.s:3584: Warning: dwarf line number information for .data ignored
encrypt.c: /tmp/ccRXkkwA.s:3585: Warning: dwarf line number information for .data ignored
encrypt.c: /tmp/ccRXkkwA.s:3588: Warning: dwarf line number information for .data ignored
encrypt.c: /tmp/ccRXkkwA.s:3591: Warning: dwarf line number information for .data ignored
encrypt.c: /tmp/ccRXkkwA.s:3595: Warning: dwarf line number information for .data ignored
encrypt.c: /tmp/ccRXkkwA.s:3597: Warning: dwarf line number information for .data ignored
encrypt.c: /tmp/ccRXkkwA.s:3600: Warning: dwarf line number information for .data ignored
encrypt.c: /tmp/ccRXkkwA.s:3602: Warning: dwarf line number information for .data ignored
encrypt.c: /tmp/ccRXkkwA.s:3603: Warning: dwarf line number information for .data ignored
encrypt.c: /tmp/ccRXkkwA.s:3606: Warning: dwarf line number information for .data ignored
encrypt.c: ...
Number of similar (implementation,compiler) pairs: 1, namely:
| Implementation | Compiler |
| T:avx1 | gcc -march=native -mtune=native -O3 -fwrapv -fPIC -fPIE -gdwarf-4 -Wall (14.2.0) |
Compiler output
encrypt.c: /tmp/cck2Q3y8.s: Assembler messages:
encrypt.c: /tmp/cck2Q3y8.s:3547: Warning: dwarf line number information for .data ignored
encrypt.c: /tmp/cck2Q3y8.s:3549: Warning: dwarf line number information for .data ignored
encrypt.c: /tmp/cck2Q3y8.s:3552: Warning: dwarf line number information for .data ignored
encrypt.c: /tmp/cck2Q3y8.s:3553: Warning: dwarf line number information for .data ignored
encrypt.c: /tmp/cck2Q3y8.s:3554: Warning: dwarf line number information for .data ignored
encrypt.c: /tmp/cck2Q3y8.s:3557: Warning: dwarf line number information for .data ignored
encrypt.c: /tmp/cck2Q3y8.s:3558: Warning: dwarf line number information for .data ignored
encrypt.c: /tmp/cck2Q3y8.s:3565: Warning: dwarf line number information for .data ignored
encrypt.c: /tmp/cck2Q3y8.s:3568: Warning: dwarf line number information for .data ignored
encrypt.c: /tmp/cck2Q3y8.s:3580: Warning: dwarf line number information for .data ignored
encrypt.c: /tmp/cck2Q3y8.s:3582: Warning: dwarf line number information for .data ignored
encrypt.c: /tmp/cck2Q3y8.s:3587: Warning: dwarf line number information for .data ignored
encrypt.c: /tmp/cck2Q3y8.s:3590: Warning: dwarf line number information for .data ignored
encrypt.c: /tmp/cck2Q3y8.s:3593: Warning: dwarf line number information for .data ignored
encrypt.c: /tmp/cck2Q3y8.s:3594: Warning: dwarf line number information for .data ignored
encrypt.c: /tmp/cck2Q3y8.s:3595: Warning: dwarf line number information for .data ignored
encrypt.c: /tmp/cck2Q3y8.s:3598: Warning: dwarf line number information for .data ignored
encrypt.c: /tmp/cck2Q3y8.s:3599: Warning: dwarf line number information for .data ignored
encrypt.c: /tmp/cck2Q3y8.s:3606: Warning: dwarf line number information for .data ignored
encrypt.c: /tmp/cck2Q3y8.s:3609: Warning: dwarf line number information for .data ignored
encrypt.c: /tmp/cck2Q3y8.s:3612: Warning: dwarf line number information for .data ignored
encrypt.c: /tmp/cck2Q3y8.s:10117: Error: leb128 operand is an undefined symbol: .LVU20
encrypt.c: /tmp/cck2Q3y8.s:10118: Error: leb128 operand is an undefined symbol: .LVU20
encrypt.c: /tmp/cck2Q3y8.s:10136: Error: leb128 operand is an undefined symbol: .LVU19
encrypt.c: ...
Number of similar (implementation,compiler) pairs: 1, namely:
| Implementation | Compiler |
| T:avx1 | gcc -march=native -mtune=native -O -fwrapv -fPIC -fPIE -gdwarf-4 -Wall (14.2.0) |
Compiler output
encrypt.c: /tmp/cc37Op6w.s: Assembler messages:
encrypt.c: /tmp/cc37Op6w.s:3547: Warning: dwarf line number information for .data ignored
encrypt.c: /tmp/cc37Op6w.s:3549: Warning: dwarf line number information for .data ignored
encrypt.c: /tmp/cc37Op6w.s:3550: Warning: dwarf line number information for .data ignored
encrypt.c: /tmp/cc37Op6w.s:3551: Warning: dwarf line number information for .data ignored
encrypt.c: /tmp/cc37Op6w.s:3553: Warning: dwarf line number information for .data ignored
encrypt.c: /tmp/cc37Op6w.s:3555: Warning: dwarf line number information for .data ignored
encrypt.c: /tmp/cc37Op6w.s:3557: Warning: dwarf line number information for .data ignored
encrypt.c: /tmp/cc37Op6w.s:3558: Warning: dwarf line number information for .data ignored
encrypt.c: /tmp/cc37Op6w.s:3561: Warning: dwarf line number information for .data ignored
encrypt.c: /tmp/cc37Op6w.s:3564: Warning: dwarf line number information for .data ignored
encrypt.c: /tmp/cc37Op6w.s:3568: Warning: dwarf line number information for .data ignored
encrypt.c: /tmp/cc37Op6w.s:3571: Warning: dwarf line number information for .data ignored
encrypt.c: /tmp/cc37Op6w.s:3580: Warning: dwarf line number information for .data ignored
encrypt.c: /tmp/cc37Op6w.s:3582: Warning: dwarf line number information for .data ignored
encrypt.c: /tmp/cc37Op6w.s:3583: Warning: dwarf line number information for .data ignored
encrypt.c: /tmp/cc37Op6w.s:3584: Warning: dwarf line number information for .data ignored
encrypt.c: /tmp/cc37Op6w.s:3587: Warning: dwarf line number information for .data ignored
encrypt.c: /tmp/cc37Op6w.s:3590: Warning: dwarf line number information for .data ignored
encrypt.c: /tmp/cc37Op6w.s:3594: Warning: dwarf line number information for .data ignored
encrypt.c: /tmp/cc37Op6w.s:3596: Warning: dwarf line number information for .data ignored
encrypt.c: /tmp/cc37Op6w.s:3599: Warning: dwarf line number information for .data ignored
encrypt.c: /tmp/cc37Op6w.s:3601: Warning: dwarf line number information for .data ignored
encrypt.c: /tmp/cc37Op6w.s:3602: Warning: dwarf line number information for .data ignored
encrypt.c: /tmp/cc37Op6w.s:3605: Warning: dwarf line number information for .data ignored
encrypt.c: ...
Number of similar (implementation,compiler) pairs: 1, namely:
| Implementation | Compiler |
| T:avx1 | gcc -march=native -mtune=native -Os -fwrapv -fPIC -fPIE -gdwarf-4 -Wall (14.2.0) |
Compiler output
try.c: /usr/bin/ld: libcrypto_aead_omdsha512k128n128tau128v1.a(omdsha512.o):.../supercop-data/thinksky/amd64/try/c/clang_-march=native_-O2_-fwrapv_-Qunused-arguments_-fPIC_-fPIE_-gdwarf-4_-Wall/timingleaks/crypto_aead/omdsha512k128n128tau128v1/sse4/work/./omdsha512.h:146: multiple definition of `Hash'; libcrypto_aead_omdsha512k128n128tau128v1.a(encrypt.o):.../supercop-data/thinksky/amd64/try/c/clang_-march=native_-O2_-fwrapv_-Qunused-arguments_-fPIC_-fPIE_-gdwarf-4_-Wall/timingleaks/crypto_aead/omdsha512k128n128tau128v1/sse4/work/./omdsha512.h:146: first defined here
try.c: clang: error: linker command failed with exit code 1 (use -v to see invocation)
Number of similar (implementation,compiler) pairs: 1, namely:
| Implementation | Compiler |
| T:sse4 | clang -march=native -O2 -fwrapv -Qunused-arguments -fPIC -fPIE -gdwarf-4 -Wall (Debian_Clang_19.1.7_(3+b1)) |
Compiler output
try.c: /usr/bin/ld: libcrypto_aead_omdsha512k128n128tau128v1.a(omdsha512.o):.../supercop-data/thinksky/amd64/try/c/clang_-march=native_-O3_-fwrapv_-Qunused-arguments_-fPIC_-fPIE_-gdwarf-4_-Wall/timingleaks/crypto_aead/omdsha512k128n128tau128v1/sse4/work/./omdsha512.h:146: multiple definition of `Hash'; libcrypto_aead_omdsha512k128n128tau128v1.a(encrypt.o):.../supercop-data/thinksky/amd64/try/c/clang_-march=native_-O3_-fwrapv_-Qunused-arguments_-fPIC_-fPIE_-gdwarf-4_-Wall/timingleaks/crypto_aead/omdsha512k128n128tau128v1/sse4/work/./omdsha512.h:146: first defined here
try.c: clang: error: linker command failed with exit code 1 (use -v to see invocation)
Number of similar (implementation,compiler) pairs: 1, namely:
| Implementation | Compiler |
| T:sse4 | clang -march=native -O3 -fwrapv -Qunused-arguments -fPIC -fPIE -gdwarf-4 -Wall (Debian_Clang_19.1.7_(3+b1)) |
Compiler output
try.c: /usr/bin/ld: libcrypto_aead_omdsha512k128n128tau128v1.a(omdsha512.o):.../supercop-data/thinksky/amd64/try/c/clang_-march=native_-O_-fwrapv_-Qunused-arguments_-fPIC_-fPIE_-gdwarf-4_-Wall/timingleaks/crypto_aead/omdsha512k128n128tau128v1/sse4/work/./omdsha512.h:146: multiple definition of `Hash'; libcrypto_aead_omdsha512k128n128tau128v1.a(encrypt.o):.../supercop-data/thinksky/amd64/try/c/clang_-march=native_-O_-fwrapv_-Qunused-arguments_-fPIC_-fPIE_-gdwarf-4_-Wall/timingleaks/crypto_aead/omdsha512k128n128tau128v1/sse4/work/./omdsha512.h:146: first defined here
try.c: clang: error: linker command failed with exit code 1 (use -v to see invocation)
Number of similar (implementation,compiler) pairs: 1, namely:
| Implementation | Compiler |
| T:sse4 | clang -march=native -O -fwrapv -Qunused-arguments -fPIC -fPIE -gdwarf-4 -Wall (Debian_Clang_19.1.7_(3+b1)) |
Compiler output
try.c: /usr/bin/ld: libcrypto_aead_omdsha512k128n128tau128v1.a(omdsha512.o):.../supercop-data/thinksky/amd64/try/c/clang_-march=native_-Os_-fwrapv_-Qunused-arguments_-fPIC_-fPIE_-gdwarf-4_-Wall/timingleaks/crypto_aead/omdsha512k128n128tau128v1/sse4/work/./omdsha512.h:146: multiple definition of `Hash'; libcrypto_aead_omdsha512k128n128tau128v1.a(encrypt.o):.../supercop-data/thinksky/amd64/try/c/clang_-march=native_-Os_-fwrapv_-Qunused-arguments_-fPIC_-fPIE_-gdwarf-4_-Wall/timingleaks/crypto_aead/omdsha512k128n128tau128v1/sse4/work/./omdsha512.h:146: first defined here
try.c: clang: error: linker command failed with exit code 1 (use -v to see invocation)
Number of similar (implementation,compiler) pairs: 1, namely:
| Implementation | Compiler |
| T:sse4 | clang -march=native -Os -fwrapv -Qunused-arguments -fPIC -fPIE -gdwarf-4 -Wall (Debian_Clang_19.1.7_(3+b1)) |
Compiler output
try.c: /usr/bin/ld: libcrypto_aead_omdsha512k128n128tau128v1.a(omdsha512.o):.../supercop-data/thinksky/amd64/try/c/clang_-mcpu=native_-O3_-fwrapv_-Qunused-arguments_-fPIC_-fPIE_-gdwarf-4_-Wall/timingleaks/crypto_aead/omdsha512k128n128tau128v1/sse4/work/./omdsha512.h:146: multiple definition of `Hash'; libcrypto_aead_omdsha512k128n128tau128v1.a(encrypt.o):.../supercop-data/thinksky/amd64/try/c/clang_-mcpu=native_-O3_-fwrapv_-Qunused-arguments_-fPIC_-fPIE_-gdwarf-4_-Wall/timingleaks/crypto_aead/omdsha512k128n128tau128v1/sse4/work/./omdsha512.h:146: first defined here
try.c: clang: error: linker command failed with exit code 1 (use -v to see invocation)
Number of similar (implementation,compiler) pairs: 1, namely:
| Implementation | Compiler |
| T:sse4 | clang -mcpu=native -O3 -fwrapv -Qunused-arguments -fPIC -fPIE -gdwarf-4 -Wall (Debian_Clang_19.1.7_(3+b1)) |
Compiler output
encrypt.c: /tmp/cc9uhP3u.s: Assembler messages:
encrypt.c: /tmp/cc9uhP3u.s:3376: Warning: dwarf line number information for .data ignored
encrypt.c: /tmp/cc9uhP3u.s:3378: Warning: dwarf line number information for .data ignored
encrypt.c: /tmp/cc9uhP3u.s:3379: Warning: dwarf line number information for .data ignored
encrypt.c: /tmp/cc9uhP3u.s:3380: Warning: dwarf line number information for .data ignored
encrypt.c: /tmp/cc9uhP3u.s:3382: Warning: dwarf line number information for .data ignored
encrypt.c: /tmp/cc9uhP3u.s:3384: Warning: dwarf line number information for .data ignored
encrypt.c: /tmp/cc9uhP3u.s:3386: Warning: dwarf line number information for .data ignored
encrypt.c: /tmp/cc9uhP3u.s:3387: Warning: dwarf line number information for .data ignored
encrypt.c: /tmp/cc9uhP3u.s:3390: Warning: dwarf line number information for .data ignored
encrypt.c: /tmp/cc9uhP3u.s:3393: Warning: dwarf line number information for .data ignored
encrypt.c: /tmp/cc9uhP3u.s:3396: Warning: dwarf line number information for .data ignored
encrypt.c: /tmp/cc9uhP3u.s:3399: Warning: dwarf line number information for .data ignored
encrypt.c: /tmp/cc9uhP3u.s:3409: Warning: dwarf line number information for .data ignored
encrypt.c: /tmp/cc9uhP3u.s:3411: Warning: dwarf line number information for .data ignored
encrypt.c: /tmp/cc9uhP3u.s:3412: Warning: dwarf line number information for .data ignored
encrypt.c: /tmp/cc9uhP3u.s:3413: Warning: dwarf line number information for .data ignored
encrypt.c: /tmp/cc9uhP3u.s:3416: Warning: dwarf line number information for .data ignored
encrypt.c: /tmp/cc9uhP3u.s:3419: Warning: dwarf line number information for .data ignored
encrypt.c: /tmp/cc9uhP3u.s:3423: Warning: dwarf line number information for .data ignored
encrypt.c: /tmp/cc9uhP3u.s:3425: Warning: dwarf line number information for .data ignored
encrypt.c: /tmp/cc9uhP3u.s:3428: Warning: dwarf line number information for .data ignored
encrypt.c: /tmp/cc9uhP3u.s:3430: Warning: dwarf line number information for .data ignored
encrypt.c: /tmp/cc9uhP3u.s:3431: Warning: dwarf line number information for .data ignored
encrypt.c: /tmp/cc9uhP3u.s:3434: Warning: dwarf line number information for .data ignored
encrypt.c: ...
Number of similar (implementation,compiler) pairs: 1, namely:
| Implementation | Compiler |
| T:sse4 | gcc -march=native -mtune=native -O2 -fwrapv -fPIC -fPIE -gdwarf-4 -Wall (14.2.0) |
Compiler output
encrypt.c: /tmp/ccTuLlwk.s: Assembler messages:
encrypt.c: /tmp/ccTuLlwk.s:3376: Warning: dwarf line number information for .data ignored
encrypt.c: /tmp/ccTuLlwk.s:3378: Warning: dwarf line number information for .data ignored
encrypt.c: /tmp/ccTuLlwk.s:3379: Warning: dwarf line number information for .data ignored
encrypt.c: /tmp/ccTuLlwk.s:3380: Warning: dwarf line number information for .data ignored
encrypt.c: /tmp/ccTuLlwk.s:3382: Warning: dwarf line number information for .data ignored
encrypt.c: /tmp/ccTuLlwk.s:3384: Warning: dwarf line number information for .data ignored
encrypt.c: /tmp/ccTuLlwk.s:3386: Warning: dwarf line number information for .data ignored
encrypt.c: /tmp/ccTuLlwk.s:3387: Warning: dwarf line number information for .data ignored
encrypt.c: /tmp/ccTuLlwk.s:3390: Warning: dwarf line number information for .data ignored
encrypt.c: /tmp/ccTuLlwk.s:3393: Warning: dwarf line number information for .data ignored
encrypt.c: /tmp/ccTuLlwk.s:3396: Warning: dwarf line number information for .data ignored
encrypt.c: /tmp/ccTuLlwk.s:3399: Warning: dwarf line number information for .data ignored
encrypt.c: /tmp/ccTuLlwk.s:3409: Warning: dwarf line number information for .data ignored
encrypt.c: /tmp/ccTuLlwk.s:3411: Warning: dwarf line number information for .data ignored
encrypt.c: /tmp/ccTuLlwk.s:3412: Warning: dwarf line number information for .data ignored
encrypt.c: /tmp/ccTuLlwk.s:3413: Warning: dwarf line number information for .data ignored
encrypt.c: /tmp/ccTuLlwk.s:3416: Warning: dwarf line number information for .data ignored
encrypt.c: /tmp/ccTuLlwk.s:3419: Warning: dwarf line number information for .data ignored
encrypt.c: /tmp/ccTuLlwk.s:3423: Warning: dwarf line number information for .data ignored
encrypt.c: /tmp/ccTuLlwk.s:3425: Warning: dwarf line number information for .data ignored
encrypt.c: /tmp/ccTuLlwk.s:3428: Warning: dwarf line number information for .data ignored
encrypt.c: /tmp/ccTuLlwk.s:3430: Warning: dwarf line number information for .data ignored
encrypt.c: /tmp/ccTuLlwk.s:3431: Warning: dwarf line number information for .data ignored
encrypt.c: /tmp/ccTuLlwk.s:3434: Warning: dwarf line number information for .data ignored
encrypt.c: ...
Number of similar (implementation,compiler) pairs: 1, namely:
| Implementation | Compiler |
| T:sse4 | gcc -march=native -mtune=native -O3 -fwrapv -fPIC -fPIE -gdwarf-4 -Wall (14.2.0) |
Compiler output
encrypt.c: /tmp/ccN8BhNE.s: Assembler messages:
encrypt.c: /tmp/ccN8BhNE.s:3375: Warning: dwarf line number information for .data ignored
encrypt.c: /tmp/ccN8BhNE.s:3377: Warning: dwarf line number information for .data ignored
encrypt.c: /tmp/ccN8BhNE.s:3380: Warning: dwarf line number information for .data ignored
encrypt.c: /tmp/ccN8BhNE.s:3381: Warning: dwarf line number information for .data ignored
encrypt.c: /tmp/ccN8BhNE.s:3382: Warning: dwarf line number information for .data ignored
encrypt.c: /tmp/ccN8BhNE.s:3385: Warning: dwarf line number information for .data ignored
encrypt.c: /tmp/ccN8BhNE.s:3386: Warning: dwarf line number information for .data ignored
encrypt.c: /tmp/ccN8BhNE.s:3393: Warning: dwarf line number information for .data ignored
encrypt.c: /tmp/ccN8BhNE.s:3396: Warning: dwarf line number information for .data ignored
encrypt.c: /tmp/ccN8BhNE.s:3408: Warning: dwarf line number information for .data ignored
encrypt.c: /tmp/ccN8BhNE.s:3410: Warning: dwarf line number information for .data ignored
encrypt.c: /tmp/ccN8BhNE.s:3415: Warning: dwarf line number information for .data ignored
encrypt.c: /tmp/ccN8BhNE.s:3418: Warning: dwarf line number information for .data ignored
encrypt.c: /tmp/ccN8BhNE.s:3421: Warning: dwarf line number information for .data ignored
encrypt.c: /tmp/ccN8BhNE.s:3422: Warning: dwarf line number information for .data ignored
encrypt.c: /tmp/ccN8BhNE.s:3423: Warning: dwarf line number information for .data ignored
encrypt.c: /tmp/ccN8BhNE.s:3426: Warning: dwarf line number information for .data ignored
encrypt.c: /tmp/ccN8BhNE.s:3427: Warning: dwarf line number information for .data ignored
encrypt.c: /tmp/ccN8BhNE.s:3434: Warning: dwarf line number information for .data ignored
encrypt.c: /tmp/ccN8BhNE.s:3437: Warning: dwarf line number information for .data ignored
encrypt.c: /tmp/ccN8BhNE.s:3440: Warning: dwarf line number information for .data ignored
encrypt.c: /tmp/ccN8BhNE.s:9945: Error: leb128 operand is an undefined symbol: .LVU20
encrypt.c: /tmp/ccN8BhNE.s:9946: Error: leb128 operand is an undefined symbol: .LVU20
encrypt.c: /tmp/ccN8BhNE.s:9964: Error: leb128 operand is an undefined symbol: .LVU19
encrypt.c: ...
Number of similar (implementation,compiler) pairs: 1, namely:
| Implementation | Compiler |
| T:sse4 | gcc -march=native -mtune=native -O -fwrapv -fPIC -fPIE -gdwarf-4 -Wall (14.2.0) |
Compiler output
encrypt.c: /tmp/cc8KnbKJ.s: Assembler messages:
encrypt.c: /tmp/cc8KnbKJ.s:3375: Warning: dwarf line number information for .data ignored
encrypt.c: /tmp/cc8KnbKJ.s:3377: Warning: dwarf line number information for .data ignored
encrypt.c: /tmp/cc8KnbKJ.s:3378: Warning: dwarf line number information for .data ignored
encrypt.c: /tmp/cc8KnbKJ.s:3379: Warning: dwarf line number information for .data ignored
encrypt.c: /tmp/cc8KnbKJ.s:3381: Warning: dwarf line number information for .data ignored
encrypt.c: /tmp/cc8KnbKJ.s:3383: Warning: dwarf line number information for .data ignored
encrypt.c: /tmp/cc8KnbKJ.s:3385: Warning: dwarf line number information for .data ignored
encrypt.c: /tmp/cc8KnbKJ.s:3386: Warning: dwarf line number information for .data ignored
encrypt.c: /tmp/cc8KnbKJ.s:3389: Warning: dwarf line number information for .data ignored
encrypt.c: /tmp/cc8KnbKJ.s:3392: Warning: dwarf line number information for .data ignored
encrypt.c: /tmp/cc8KnbKJ.s:3396: Warning: dwarf line number information for .data ignored
encrypt.c: /tmp/cc8KnbKJ.s:3399: Warning: dwarf line number information for .data ignored
encrypt.c: /tmp/cc8KnbKJ.s:3408: Warning: dwarf line number information for .data ignored
encrypt.c: /tmp/cc8KnbKJ.s:3410: Warning: dwarf line number information for .data ignored
encrypt.c: /tmp/cc8KnbKJ.s:3411: Warning: dwarf line number information for .data ignored
encrypt.c: /tmp/cc8KnbKJ.s:3412: Warning: dwarf line number information for .data ignored
encrypt.c: /tmp/cc8KnbKJ.s:3415: Warning: dwarf line number information for .data ignored
encrypt.c: /tmp/cc8KnbKJ.s:3418: Warning: dwarf line number information for .data ignored
encrypt.c: /tmp/cc8KnbKJ.s:3422: Warning: dwarf line number information for .data ignored
encrypt.c: /tmp/cc8KnbKJ.s:3424: Warning: dwarf line number information for .data ignored
encrypt.c: /tmp/cc8KnbKJ.s:3427: Warning: dwarf line number information for .data ignored
encrypt.c: /tmp/cc8KnbKJ.s:3429: Warning: dwarf line number information for .data ignored
encrypt.c: /tmp/cc8KnbKJ.s:3430: Warning: dwarf line number information for .data ignored
encrypt.c: /tmp/cc8KnbKJ.s:3433: Warning: dwarf line number information for .data ignored
encrypt.c: ...
Number of similar (implementation,compiler) pairs: 1, namely:
| Implementation | Compiler |
| T:sse4 | gcc -march=native -mtune=native -Os -fwrapv -fPIC -fPIE -gdwarf-4 -Wall (14.2.0) |
Namespace violations
omdsha512.o calc_L_i T
omdsha512.o double_block T
omdsha512.o final_masking_associated_data T
omdsha512.o final_masking_message T
omdsha512.o hash T
omdsha512.o increment_masking_associated_data T
omdsha512.o increment_masking_message T
omdsha512.o key_func T
omdsha512.o l2b T
omdsha512.o ntz T
omdsha512.o omdsha512_process T
omdsha512.o triple_block T
omdsha512.o xor_block T
sha512.o sha512_comp T
Number of similar (implementation,compiler) pairs: 9, namely:
| Implementation | Compiler |
| T:ref | clang -march=native -O2 -fwrapv -Qunused-arguments -fPIC -fPIE -gdwarf-4 -Wall (Debian_Clang_19.1.7_(3+b1)) |
| T:ref | clang -march=native -O3 -fwrapv -Qunused-arguments -fPIC -fPIE -gdwarf-4 -Wall (Debian_Clang_19.1.7_(3+b1)) |
| T:ref | clang -march=native -O -fwrapv -Qunused-arguments -fPIC -fPIE -gdwarf-4 -Wall (Debian_Clang_19.1.7_(3+b1)) |
| T:ref | clang -march=native -Os -fwrapv -Qunused-arguments -fPIC -fPIE -gdwarf-4 -Wall (Debian_Clang_19.1.7_(3+b1)) |
| T:ref | clang -mcpu=native -O3 -fwrapv -Qunused-arguments -fPIC -fPIE -gdwarf-4 -Wall (Debian_Clang_19.1.7_(3+b1)) |
| T:ref | gcc -march=native -mtune=native -O2 -fwrapv -fPIC -fPIE -gdwarf-4 -Wall (14.2.0) |
| T:ref | gcc -march=native -mtune=native -O3 -fwrapv -fPIC -fPIE -gdwarf-4 -Wall (14.2.0) |
| T:ref | gcc -march=native -mtune=native -O -fwrapv -fPIC -fPIE -gdwarf-4 -Wall (14.2.0) |
| T:ref | gcc -march=native -mtune=native -Os -fwrapv -fPIC -fPIE -gdwarf-4 -Wall (14.2.0) |