Test results for amd64, thinksky, crypto_aead/ascon80pqv12

[Page version: 20261028 01:16:00]

Measurements for amd64, thinksky, crypto_aead Test results for amd64, thinksky, crypto_aead Test results for crypto_aead/ascon80pqv12
Computer: thinksky
Microarchitecture: amd64; Skylake (506e3)
Architecture: amd64
CPU ID: GenuineIntel-000506e3-bfebfbff
SUPERCOP version: 20261018
Operation: crypto_aead
Primitive: ascon80pqv12
TimeObject sizeTest sizeImplementationCompilerBenchmark dateSUPERCOP version
6839315044 0 042384 1272 1624opt64clang -mcpu=native -O3 -fwrapv -Qunused-arguments -fPIC -fPIE -gdwarf-4 -Wall2026101920261018
7257614298 0 037578 1208 1688opt64gcc -march=native -mtune=native -Os -fwrapv -fPIC -fPIE -gdwarf-4 -Wall2026101920261018
7259314473 0 042780 1272 1688opt64clang -march=native -O2 -fwrapv -Qunused-arguments -fPIC -fPIE -gdwarf-4 -Wall2026101920261018
7291214473 0 042732 1272 1688opt64clang -march=native -O3 -fwrapv -Qunused-arguments -fPIC -fPIE -gdwarf-4 -Wall2026101920261018
7320714440 0 039514 1264 1688opt64clang -march=native -Os -fwrapv -Qunused-arguments -fPIC -fPIE -gdwarf-4 -Wall2026101920261018
7323715308 0 040423 1232 1720opt64gcc -march=native -mtune=native -O2 -fwrapv -fPIC -fPIE -gdwarf-4 -Wall2026101920261018
7329215308 0 042831 1232 1720opt64gcc -march=native -mtune=native -O3 -fwrapv -fPIC -fPIE -gdwarf-4 -Wall2026101920261018
7385914376 0 038848 1272 1624opt64clang -march=native -O -fwrapv -Qunused-arguments -fPIC -fPIE -gdwarf-4 -Wall2026101920261018
7534017916 0 042726 1224 1720opt64gcc -march=native -mtune=native -O -fwrapv -fPIC -fPIE -gdwarf-4 -Wall2026101920261018
781505592 0 033844 1272 1688refclang -march=native -O3 -fwrapv -Qunused-arguments -fPIC -fPIE -gdwarf-4 -Wall2026101920261018
783545592 0 033924 1272 1688refclang -march=native -O2 -fwrapv -Qunused-arguments -fPIC -fPIE -gdwarf-4 -Wall2026101920261018
797511705 0 029016 1272 1624opt64_lowsizeclang -mcpu=native -O3 -fwrapv -Qunused-arguments -fPIC -fPIE -gdwarf-4 -Wall2026101920261018
8042418410 0 045911 1232 1720refgcc -march=native -mtune=native -O3 -fwrapv -fPIC -fPIE -gdwarf-4 -Wall2026101920261018
805791714 0 029956 1272 1688opt64_lowsizeclang -march=native -O3 -fwrapv -Qunused-arguments -fPIC -fPIE -gdwarf-4 -Wall2026101920261018
805867110 0 034464 1272 1624refclang -mcpu=native -O3 -fwrapv -Qunused-arguments -fPIC -fPIE -gdwarf-4 -Wall2026101920261018
809071505 0 024746 1208 1688opt64_lowsizegcc -march=native -mtune=native -Os -fwrapv -fPIC -fPIE -gdwarf-4 -Wall2026101920261018
809521531 0 029836 1272 1688opt64_lowsizeclang -march=native -O2 -fwrapv -Qunused-arguments -fPIC -fPIE -gdwarf-4 -Wall2026101920261018
809521442 0 025928 1272 1624opt64_lowsizeclang -march=native -O -fwrapv -Qunused-arguments -fPIC -fPIE -gdwarf-4 -Wall2026101920261018
811651514 0 026522 1264 1688opt64_lowsizeclang -march=native -Os -fwrapv -Qunused-arguments -fPIC -fPIE -gdwarf-4 -Wall2026101920261018
8284110801 0 035662 1224 1720refgcc -march=native -mtune=native -O -fwrapv -fPIC -fPIE -gdwarf-4 -Wall2026101920261018
830302185 0 029663 1232 1720opt64_lowsizegcc -march=native -mtune=native -O3 -fwrapv -fPIC -fPIE -gdwarf-4 -Wall2026101920261018
8320610816 0 035959 1232 1720refgcc -march=native -mtune=native -O2 -fwrapv -fPIC -fPIE -gdwarf-4 -Wall2026101920261018
836028316 0 032990 1264 1688refclang -march=native -Os -fwrapv -Qunused-arguments -fPIC -fPIE -gdwarf-4 -Wall2026101920261018
8378817796 0 042280 1272 1624opt32clang -march=native -O -fwrapv -Qunused-arguments -fPIC -fPIE -gdwarf-4 -Wall2026101920261018
8396518124 0 043098 1264 1688opt32clang -march=native -Os -fwrapv -Qunused-arguments -fPIC -fPIE -gdwarf-4 -Wall2026101920261018
845161857 0 026919 1232 1720opt64_lowsizegcc -march=native -mtune=native -O2 -fwrapv -fPIC -fPIE -gdwarf-4 -Wall2026101920261018
8480518142 0 046364 1272 1688opt32clang -march=native -O2 -fwrapv -Qunused-arguments -fPIC -fPIE -gdwarf-4 -Wall2026101920261018
8489818980 0 046479 1232 1720opt32gcc -march=native -mtune=native -O3 -fwrapv -fPIC -fPIE -gdwarf-4 -Wall2026101920261018
8526618174 0 046316 1272 1688opt32clang -march=native -O3 -fwrapv -Qunused-arguments -fPIC -fPIE -gdwarf-4 -Wall2026101920261018
8575718980 0 044103 1232 1720opt32gcc -march=native -mtune=native -O2 -fwrapv -fPIC -fPIE -gdwarf-4 -Wall2026101920261018
868092877 0 027686 1224 1720opt64_lowsizegcc -march=native -mtune=native -O -fwrapv -fPIC -fPIE -gdwarf-4 -Wall2026101920261018
8765218960 0 042250 1208 1688opt32gcc -march=native -mtune=native -Os -fwrapv -fPIC -fPIE -gdwarf-4 -Wall2026101920261018
883445464 0 029968 1272 1624refclang -march=native -O -fwrapv -Qunused-arguments -fPIC -fPIE -gdwarf-4 -Wall2026101920261018
9211921739 0 046566 1224 1720opt32gcc -march=native -mtune=native -O -fwrapv -fPIC -fPIE -gdwarf-4 -Wall2026101920261018
9218420446 0 047760 1272 1624opt32clang -mcpu=native -O3 -fwrapv -Qunused-arguments -fPIC -fPIE -gdwarf-4 -Wall2026101920261018
933452230 0 029703 1232 1720opt32_lowsizegcc -march=native -mtune=native -O3 -fwrapv -fPIC -fPIE -gdwarf-4 -Wall2026101920261018
941461753 0 029988 1272 1688opt32_lowsizeclang -march=native -O3 -fwrapv -Qunused-arguments -fPIC -fPIE -gdwarf-4 -Wall2026101920261018
943291481 0 025960 1272 1624opt32_lowsizeclang -march=native -O -fwrapv -Qunused-arguments -fPIC -fPIE -gdwarf-4 -Wall2026101920261018
945351553 0 026554 1264 1688opt32_lowsizeclang -march=native -Os -fwrapv -Qunused-arguments -fPIC -fPIE -gdwarf-4 -Wall2026101920261018
947551902 0 026959 1232 1720opt32_lowsizegcc -march=native -mtune=native -O2 -fwrapv -fPIC -fPIE -gdwarf-4 -Wall2026101920261018
955771570 0 029868 1272 1688opt32_lowsizeclang -march=native -O2 -fwrapv -Qunused-arguments -fPIC -fPIE -gdwarf-4 -Wall2026101920261018
982881575 0 024818 1208 1688opt32_lowsizegcc -march=native -mtune=native -Os -fwrapv -fPIC -fPIE -gdwarf-4 -Wall2026101920261018
1016211749 0 029064 1272 1624opt32_lowsizeclang -mcpu=native -O3 -fwrapv -Qunused-arguments -fPIC -fPIE -gdwarf-4 -Wall2026101920261018
1027782954 0 027766 1224 1720opt32_lowsizegcc -march=native -mtune=native -O -fwrapv -fPIC -fPIE -gdwarf-4 -Wall2026101920261018
1149332593 0 025914 1208 1688refgcc -march=native -mtune=native -Os -fwrapv -fPIC -fPIE -gdwarf-4 -Wall2026101920261018
16212312830 0 037830 1264 1688bi32clang -march=native -Os -fwrapv -Qunused-arguments -fPIC -fPIE -gdwarf-4 -Wall2026101920261018
16297512729 0 040940 1272 1688bi32clang -march=native -O3 -fwrapv -Qunused-arguments -fPIC -fPIE -gdwarf-4 -Wall2026101920261018
16316612729 0 041020 1272 1688bi32clang -march=native -O2 -fwrapv -Qunused-arguments -fPIC -fPIE -gdwarf-4 -Wall2026101920261018
16524212944 0 037424 1272 1624bi32clang -march=native -O -fwrapv -Qunused-arguments -fPIC -fPIE -gdwarf-4 -Wall2026101920261018
16621014725 0 042235 1232 1720bi32gcc -march=native -mtune=native -O3 -fwrapv -fPIC -fPIE -gdwarf-4 -Wall2026101920261018
16762514728 0 039799 1232 1720bi32gcc -march=native -mtune=native -O2 -fwrapv -fPIC -fPIE -gdwarf-4 -Wall2026101920261018
17071613739 0 036978 1208 1688bi32gcc -march=native -mtune=native -Os -fwrapv -fPIC -fPIE -gdwarf-4 -Wall2026101920261018
17361516260 0 041038 1224 1720bi32gcc -march=native -mtune=native -O -fwrapv -fPIC -fPIE -gdwarf-4 -Wall2026101920261018
17414912932 0 040272 1272 1624bi32clang -mcpu=native -O3 -fwrapv -Qunused-arguments -fPIC -fPIE -gdwarf-4 -Wall2026101920261018
1794438830 0 033384 1272 1624bi32_lowregclang -march=native -O -fwrapv -Qunused-arguments -fPIC -fPIE -gdwarf-4 -Wall2026101920261018
1796508606 0 036924 1272 1688bi32_lowregclang -march=native -O3 -fwrapv -Qunused-arguments -fPIC -fPIE -gdwarf-4 -Wall2026101920261018
1798468606 0 036972 1272 1688bi32_lowregclang -march=native -O2 -fwrapv -Qunused-arguments -fPIC -fPIE -gdwarf-4 -Wall2026101920261018
1804678202 0 031514 1208 1688bi32_lowreggcc -march=native -mtune=native -Os -fwrapv -fPIC -fPIE -gdwarf-4 -Wall2026101920261018
1805898586 0 033682 1264 1688bi32_lowregclang -march=native -Os -fwrapv -Qunused-arguments -fPIC -fPIE -gdwarf-4 -Wall2026101920261018
1811589090 0 036667 1232 1720bi32_lowreggcc -march=native -mtune=native -O3 -fwrapv -fPIC -fPIE -gdwarf-4 -Wall2026101920261018
1813962652 0 030860 1272 1688bi32_lowsizeclang -march=native -O3 -fwrapv -Qunused-arguments -fPIC -fPIE -gdwarf-4 -Wall2026101920261018
1820919090 0 034239 1232 1720bi32_lowreggcc -march=native -mtune=native -O2 -fwrapv -fPIC -fPIE -gdwarf-4 -Wall2026101920261018
1824682459 0 027458 1264 1688bi32_lowsizeclang -march=native -Os -fwrapv -Qunused-arguments -fPIC -fPIE -gdwarf-4 -Wall2026101920261018
1828532447 0 030716 1272 1688bi32_lowsizeclang -march=native -O2 -fwrapv -Qunused-arguments -fPIC -fPIE -gdwarf-4 -Wall2026101920261018
1829642375 0 026840 1272 1624bi32_lowsizeclang -march=native -O -fwrapv -Qunused-arguments -fPIC -fPIE -gdwarf-4 -Wall2026101920261018
1842312735 0 027839 1232 1720bi32_lowsizegcc -march=native -mtune=native -O2 -fwrapv -fPIC -fPIE -gdwarf-4 -Wall2026101920261018
1850883004 0 030511 1232 1720bi32_lowsizegcc -march=native -mtune=native -O3 -fwrapv -fPIC -fPIE -gdwarf-4 -Wall2026101920261018
1853122301 0 025530 1208 1688bi32_lowsizegcc -march=native -mtune=native -Os -fwrapv -fPIC -fPIE -gdwarf-4 -Wall2026101920261018
18664310869 0 035726 1224 1720bi32_lowreggcc -march=native -mtune=native -O -fwrapv -fPIC -fPIE -gdwarf-4 -Wall2026101920261018
1868342626 0 029936 1272 1624bi32_lowsizeclang -mcpu=native -O3 -fwrapv -Qunused-arguments -fPIC -fPIE -gdwarf-4 -Wall2026101920261018
1895338772 0 036176 1272 1624bi32_lowregclang -mcpu=native -O3 -fwrapv -Qunused-arguments -fPIC -fPIE -gdwarf-4 -Wall2026101920261018
1939922803 0 027598 1224 1720bi32_lowsizegcc -march=native -mtune=native -O -fwrapv -fPIC -fPIE -gdwarf-4 -Wall2026101920261018
5762596063 0 034212 1272 1688opt8clang -march=native -O2 -fwrapv -Qunused-arguments -fPIC -fPIE -gdwarf-4 -Wall2026101920261018
5765546178 0 034404 1272 1688opt8_lowsizeclang -march=native -O2 -fwrapv -Qunused-arguments -fPIC -fPIE -gdwarf-4 -Wall2026101920261018
6192489684 0 036496 1272 1624bi8clang -mcpu=native -O3 -fwrapv -Qunused-arguments -fPIC -fPIE -gdwarf-4 -Wall2026101920261018
6207993570 0 028618 1264 1688opt8clang -march=native -Os -fwrapv -Qunused-arguments -fPIC -fPIE -gdwarf-4 -Wall2026101920261018
6242853498 0 028498 1264 1688opt8_lowsizeclang -march=native -Os -fwrapv -Qunused-arguments -fPIC -fPIE -gdwarf-4 -Wall2026101920261018
6634179093 0 033690 1264 1688bi8clang -march=native -Os -fwrapv -Qunused-arguments -fPIC -fPIE -gdwarf-4 -Wall2026101920261018
6732299202 0 036884 1272 1688bi8clang -march=native -O3 -fwrapv -Qunused-arguments -fPIC -fPIE -gdwarf-4 -Wall2026101920261018
6794889202 0 036948 1272 1688bi8clang -march=native -O2 -fwrapv -Qunused-arguments -fPIC -fPIE -gdwarf-4 -Wall2026101920261018
7050849733 0 033856 1272 1624bi8clang -march=native -O -fwrapv -Qunused-arguments -fPIC -fPIE -gdwarf-4 -Wall2026101920261018
7145523877 0 029023 1232 1720opt8gcc -march=native -mtune=native -O2 -fwrapv -fPIC -fPIE -gdwarf-4 -Wall2026101920261018
7161193710 0 028847 1232 1720opt8_lowsizegcc -march=native -mtune=native -O2 -fwrapv -fPIC -fPIE -gdwarf-4 -Wall2026101920261018
8375986885 0 034232 1272 1624opt8clang -mcpu=native -O3 -fwrapv -Qunused-arguments -fPIC -fPIE -gdwarf-4 -Wall2026101920261018
8421307414 0 034768 1272 1624opt8_lowsizeclang -mcpu=native -O3 -fwrapv -Qunused-arguments -fPIC -fPIE -gdwarf-4 -Wall2026101920261018
8562208994 0 036087 1232 1720bi8gcc -march=native -mtune=native -O3 -fwrapv -fPIC -fPIE -gdwarf-4 -Wall2026101920261018
8572269620 0 032682 1208 1688bi8gcc -march=native -mtune=native -Os -fwrapv -fPIC -fPIE -gdwarf-4 -Wall2026101920261018
8586248994 0 033679 1232 1720bi8gcc -march=native -mtune=native -O2 -fwrapv -fPIC -fPIE -gdwarf-4 -Wall2026101920261018
86962613507 0 037926 1224 1720bi8gcc -march=native -mtune=native -O -fwrapv -fPIC -fPIE -gdwarf-4 -Wall2026101920261018
8841146994 0 035092 1272 1688opt8clang -march=native -O3 -fwrapv -Qunused-arguments -fPIC -fPIE -gdwarf-4 -Wall2026101920261018
8896387109 0 035284 1272 1688opt8_lowsizeclang -march=native -O3 -fwrapv -Qunused-arguments -fPIC -fPIE -gdwarf-4 -Wall2026101920261018
10039054714 0 029224 1272 1624opt8clang -march=native -O -fwrapv -Qunused-arguments -fPIC -fPIE -gdwarf-4 -Wall2026101920261018
10143983981 0 028504 1272 1624opt8_lowsizeclang -march=native -O -fwrapv -Qunused-arguments -fPIC -fPIE -gdwarf-4 -Wall2026101920261018
14583545904 0 030774 1224 1720opt8gcc -march=native -mtune=native -O -fwrapv -fPIC -fPIE -gdwarf-4 -Wall2026101920261018
14588285729 0 030590 1224 1720opt8_lowsizegcc -march=native -mtune=native -O -fwrapv -fPIC -fPIE -gdwarf-4 -Wall2026101920261018
14816948255 0 035799 1232 1720opt8gcc -march=native -mtune=native -O3 -fwrapv -fPIC -fPIE -gdwarf-4 -Wall2026101920261018
14872587491 0 035007 1232 1720opt8_lowsizegcc -march=native -mtune=native -O3 -fwrapv -fPIC -fPIE -gdwarf-4 -Wall2026101920261018
16006684917 0 028242 1208 1688opt8gcc -march=native -mtune=native -Os -fwrapv -fPIC -fPIE -gdwarf-4 -Wall2026101920261018
16017134730 0 028002 1208 1688opt8_lowsizegcc -march=native -mtune=native -Os -fwrapv -fPIC -fPIE -gdwarf-4 -Wall2026101920261018

Compiler output


ascon.S: ascon.S:1:10: fatal error: 'xtensa/coreasm.h' file not found
ascon.S:     1 | #include <xtensa/coreasm.h>
ascon.S:       |          ^~~~~~~~~~~~~~~~~~
ascon.S: 1 error generated.

Number of similar (implementation,compiler) pairs: 5, namely:
ImplementationCompiler
T:asm_esp32clang -march=native -O2 -fwrapv -Qunused-arguments -fPIC -fPIE -gdwarf-4 -Wall (Debian_Clang_19.1.7_(3+b1))
T:asm_esp32clang -march=native -O3 -fwrapv -Qunused-arguments -fPIC -fPIE -gdwarf-4 -Wall (Debian_Clang_19.1.7_(3+b1))
T:asm_esp32clang -march=native -O -fwrapv -Qunused-arguments -fPIC -fPIE -gdwarf-4 -Wall (Debian_Clang_19.1.7_(3+b1))
T:asm_esp32clang -march=native -Os -fwrapv -Qunused-arguments -fPIC -fPIE -gdwarf-4 -Wall (Debian_Clang_19.1.7_(3+b1))
T:asm_esp32clang -mcpu=native -O3 -fwrapv -Qunused-arguments -fPIC -fPIE -gdwarf-4 -Wall (Debian_Clang_19.1.7_(3+b1))

Compiler output


ascon.S: ascon.S:1:10: fatal error: xtensa/coreasm.h: No such file or directory
ascon.S:     1 | #include <xtensa/coreasm.h>
ascon.S:       |          ^~~~~~~~~~~~~~~~~~
ascon.S: compilation terminated.

Number of similar (implementation,compiler) pairs: 4, namely:
ImplementationCompiler
T:asm_esp32gcc -march=native -mtune=native -O2 -fwrapv -fPIC -fPIE -gdwarf-4 -Wall (14.2.0)
T:asm_esp32gcc -march=native -mtune=native -O3 -fwrapv -fPIC -fPIE -gdwarf-4 -Wall (14.2.0)
T:asm_esp32gcc -march=native -mtune=native -O -fwrapv -fPIC -fPIE -gdwarf-4 -Wall (14.2.0)
T:asm_esp32gcc -march=native -mtune=native -Os -fwrapv -fPIC -fPIE -gdwarf-4 -Wall (14.2.0)

Compiler output


update.c: update.c:21:13: warning: unused variable 'rate' [-Wunused-variable]
update.c:    21 |   const int rate = ASCON_AEAD_RATE;
update.c:       |             ^~~~
update.c: 1 warning generated.

Number of similar (implementation,compiler) pairs: 15, namely:
ImplementationCompiler
bi32_lowsizeclang -march=native -O2 -fwrapv -Qunused-arguments -fPIC -fPIE -gdwarf-4 -Wall (Debian_Clang_19.1.7_(3+b1))
bi32_lowsizeclang -march=native -O3 -fwrapv -Qunused-arguments -fPIC -fPIE -gdwarf-4 -Wall (Debian_Clang_19.1.7_(3+b1))
bi32_lowsizeclang -march=native -O -fwrapv -Qunused-arguments -fPIC -fPIE -gdwarf-4 -Wall (Debian_Clang_19.1.7_(3+b1))
bi32_lowsizeclang -march=native -Os -fwrapv -Qunused-arguments -fPIC -fPIE -gdwarf-4 -Wall (Debian_Clang_19.1.7_(3+b1))
bi32_lowsizeclang -mcpu=native -O3 -fwrapv -Qunused-arguments -fPIC -fPIE -gdwarf-4 -Wall (Debian_Clang_19.1.7_(3+b1))
opt32_lowsizeclang -march=native -O2 -fwrapv -Qunused-arguments -fPIC -fPIE -gdwarf-4 -Wall (Debian_Clang_19.1.7_(3+b1))
opt32_lowsizeclang -march=native -O3 -fwrapv -Qunused-arguments -fPIC -fPIE -gdwarf-4 -Wall (Debian_Clang_19.1.7_(3+b1))
opt32_lowsizeclang -march=native -O -fwrapv -Qunused-arguments -fPIC -fPIE -gdwarf-4 -Wall (Debian_Clang_19.1.7_(3+b1))
opt32_lowsizeclang -march=native -Os -fwrapv -Qunused-arguments -fPIC -fPIE -gdwarf-4 -Wall (Debian_Clang_19.1.7_(3+b1))
opt32_lowsizeclang -mcpu=native -O3 -fwrapv -Qunused-arguments -fPIC -fPIE -gdwarf-4 -Wall (Debian_Clang_19.1.7_(3+b1))
opt64_lowsizeclang -march=native -O2 -fwrapv -Qunused-arguments -fPIC -fPIE -gdwarf-4 -Wall (Debian_Clang_19.1.7_(3+b1))
opt64_lowsizeclang -march=native -O3 -fwrapv -Qunused-arguments -fPIC -fPIE -gdwarf-4 -Wall (Debian_Clang_19.1.7_(3+b1))
opt64_lowsizeclang -march=native -O -fwrapv -Qunused-arguments -fPIC -fPIE -gdwarf-4 -Wall (Debian_Clang_19.1.7_(3+b1))
opt64_lowsizeclang -march=native -Os -fwrapv -Qunused-arguments -fPIC -fPIE -gdwarf-4 -Wall (Debian_Clang_19.1.7_(3+b1))
opt64_lowsizeclang -mcpu=native -O3 -fwrapv -Qunused-arguments -fPIC -fPIE -gdwarf-4 -Wall (Debian_Clang_19.1.7_(3+b1))

Compiler output


update.c: update.c: In function 'ascon_update':
update.c: update.c:21:13: warning: unused variable 'rate' [-Wunused-variable]
update.c:    21 |   const int rate = ASCON_AEAD_RATE;
update.c:       |             ^~~~

Number of similar (implementation,compiler) pairs: 12, namely:
ImplementationCompiler
bi32_lowsizegcc -march=native -mtune=native -O2 -fwrapv -fPIC -fPIE -gdwarf-4 -Wall (14.2.0)
bi32_lowsizegcc -march=native -mtune=native -O3 -fwrapv -fPIC -fPIE -gdwarf-4 -Wall (14.2.0)
bi32_lowsizegcc -march=native -mtune=native -O -fwrapv -fPIC -fPIE -gdwarf-4 -Wall (14.2.0)
bi32_lowsizegcc -march=native -mtune=native -Os -fwrapv -fPIC -fPIE -gdwarf-4 -Wall (14.2.0)
opt32_lowsizegcc -march=native -mtune=native -O2 -fwrapv -fPIC -fPIE -gdwarf-4 -Wall (14.2.0)
opt32_lowsizegcc -march=native -mtune=native -O3 -fwrapv -fPIC -fPIE -gdwarf-4 -Wall (14.2.0)
opt32_lowsizegcc -march=native -mtune=native -O -fwrapv -fPIC -fPIE -gdwarf-4 -Wall (14.2.0)
opt32_lowsizegcc -march=native -mtune=native -Os -fwrapv -fPIC -fPIE -gdwarf-4 -Wall (14.2.0)
opt64_lowsizegcc -march=native -mtune=native -O2 -fwrapv -fPIC -fPIE -gdwarf-4 -Wall (14.2.0)
opt64_lowsizegcc -march=native -mtune=native -O3 -fwrapv -fPIC -fPIE -gdwarf-4 -Wall (14.2.0)
opt64_lowsizegcc -march=native -mtune=native -O -fwrapv -fPIC -fPIE -gdwarf-4 -Wall (14.2.0)
opt64_lowsizegcc -march=native -mtune=native -Os -fwrapv -fPIC -fPIE -gdwarf-4 -Wall (14.2.0)

Compiler output


try.c: /usr/bin/ld: /tmp/try-small-d943ec.o: in function `doit':
try.c: .../supercop-data/thinksky/amd64/try/c/clang_-march=native_-O2_-fwrapv_-Qunused-arguments_-fPIC_-fPIE_-gdwarf-4_-Wall/timingleaks/crypto_aead/ascon80pqv12/esp32/work/./try.c:133:(.text+0x...): undefined reference to `crypto_aead_ascon80pqv12_esp32_timingleaks_encrypt'
try.c: /usr/bin/ld: .../supercop-data/thinksky/amd64/try/c/clang_-march=native_-O2_-fwrapv_-Qunused-arguments_-fPIC_-fPIE_-gdwarf-4_-Wall/timingleaks/crypto_aead/ascon80pqv12/esp32/work/./try.c:135:(.text+0x...): undefined reference to `crypto_aead_ascon80pqv12_esp32_timingleaks_decrypt'
try.c: /usr/bin/ld: /tmp/try-small-d943ec.o: in function `test':
try.c: .../supercop-data/thinksky/amd64/try/c/clang_-march=native_-O2_-fwrapv_-Qunused-arguments_-fPIC_-fPIE_-gdwarf-4_-Wall/timingleaks/crypto_aead/ascon80pqv12/esp32/work/./try.c:159:(.text+0x...): undefined reference to `crypto_aead_ascon80pqv12_esp32_timingleaks_encrypt'
try.c: /usr/bin/ld: .../supercop-data/thinksky/amd64/try/c/clang_-march=native_-O2_-fwrapv_-Qunused-arguments_-fPIC_-fPIE_-gdwarf-4_-Wall/timingleaks/crypto_aead/ascon80pqv12/esp32/work/./try.c:189:(.text+0x...): undefined reference to `crypto_aead_ascon80pqv12_esp32_timingleaks_encrypt'
try.c: /usr/bin/ld: .../supercop-data/thinksky/amd64/try/c/clang_-march=native_-O2_-fwrapv_-Qunused-arguments_-fPIC_-fPIE_-gdwarf-4_-Wall/timingleaks/crypto_aead/ascon80pqv12/esp32/work/./try.c:300:(.text+0x...): undefined reference to `crypto_aead_ascon80pqv12_esp32_timingleaks_decrypt'
try.c: /usr/bin/ld: .../supercop-data/thinksky/amd64/try/c/clang_-march=native_-O2_-fwrapv_-Qunused-arguments_-fPIC_-fPIE_-gdwarf-4_-Wall/timingleaks/crypto_aead/ascon80pqv12/esp32/work/./try.c:331:(.text+0x...): undefined reference to `crypto_aead_ascon80pqv12_esp32_timingleaks_decrypt'
try.c: /usr/bin/ld: .../supercop-data/thinksky/amd64/try/c/clang_-march=native_-O2_-fwrapv_-Qunused-arguments_-fPIC_-fPIE_-gdwarf-4_-Wall/timingleaks/crypto_aead/ascon80pqv12/esp32/work/./try.c:476:(.text+0x...): undefined reference to `crypto_aead_ascon80pqv12_esp32_timingleaks_decrypt'
try.c: /usr/bin/ld: .../supercop-data/thinksky/amd64/try/c/clang_-march=native_-O2_-fwrapv_-Qunused-arguments_-fPIC_-fPIE_-gdwarf-4_-Wall/timingleaks/crypto_aead/ascon80pqv12/esp32/work/./try.c:480:(.text+0x...): undefined reference to `crypto_aead_ascon80pqv12_esp32_timingleaks_decrypt'
try.c: /usr/bin/ld: .../supercop-data/thinksky/amd64/try/c/clang_-march=native_-O2_-fwrapv_-Qunused-arguments_-fPIC_-fPIE_-gdwarf-4_-Wall/timingleaks/crypto_aead/ascon80pqv12/esp32/work/./try.c:484:(.text+0x...): undefined reference to `crypto_aead_ascon80pqv12_esp32_timingleaks_decrypt'
try.c: clang: error: linker command failed with exit code 1 (use -v to see invocation)

Number of similar (implementation,compiler) pairs: 1, namely:
ImplementationCompiler
T:esp32clang -march=native -O2 -fwrapv -Qunused-arguments -fPIC -fPIE -gdwarf-4 -Wall (Debian_Clang_19.1.7_(3+b1))

Compiler output


try.c: /usr/bin/ld: /tmp/try-small-515ebc.o: in function `doit':
try.c: .../supercop-data/thinksky/amd64/try/c/clang_-march=native_-O3_-fwrapv_-Qunused-arguments_-fPIC_-fPIE_-gdwarf-4_-Wall/timingleaks/crypto_aead/ascon80pqv12/esp32/work/./try.c:133:(.text+0x...): undefined reference to `crypto_aead_ascon80pqv12_esp32_timingleaks_encrypt'
try.c: /usr/bin/ld: .../supercop-data/thinksky/amd64/try/c/clang_-march=native_-O3_-fwrapv_-Qunused-arguments_-fPIC_-fPIE_-gdwarf-4_-Wall/timingleaks/crypto_aead/ascon80pqv12/esp32/work/./try.c:135:(.text+0x...): undefined reference to `crypto_aead_ascon80pqv12_esp32_timingleaks_decrypt'
try.c: /usr/bin/ld: /tmp/try-small-515ebc.o: in function `test':
try.c: .../supercop-data/thinksky/amd64/try/c/clang_-march=native_-O3_-fwrapv_-Qunused-arguments_-fPIC_-fPIE_-gdwarf-4_-Wall/timingleaks/crypto_aead/ascon80pqv12/esp32/work/./try.c:159:(.text+0x...): undefined reference to `crypto_aead_ascon80pqv12_esp32_timingleaks_encrypt'
try.c: /usr/bin/ld: .../supercop-data/thinksky/amd64/try/c/clang_-march=native_-O3_-fwrapv_-Qunused-arguments_-fPIC_-fPIE_-gdwarf-4_-Wall/timingleaks/crypto_aead/ascon80pqv12/esp32/work/./try.c:189:(.text+0x...): undefined reference to `crypto_aead_ascon80pqv12_esp32_timingleaks_encrypt'
try.c: /usr/bin/ld: .../supercop-data/thinksky/amd64/try/c/clang_-march=native_-O3_-fwrapv_-Qunused-arguments_-fPIC_-fPIE_-gdwarf-4_-Wall/timingleaks/crypto_aead/ascon80pqv12/esp32/work/./try.c:300:(.text+0x...): undefined reference to `crypto_aead_ascon80pqv12_esp32_timingleaks_decrypt'
try.c: /usr/bin/ld: .../supercop-data/thinksky/amd64/try/c/clang_-march=native_-O3_-fwrapv_-Qunused-arguments_-fPIC_-fPIE_-gdwarf-4_-Wall/timingleaks/crypto_aead/ascon80pqv12/esp32/work/./try.c:331:(.text+0x...): undefined reference to `crypto_aead_ascon80pqv12_esp32_timingleaks_decrypt'
try.c: /usr/bin/ld: .../supercop-data/thinksky/amd64/try/c/clang_-march=native_-O3_-fwrapv_-Qunused-arguments_-fPIC_-fPIE_-gdwarf-4_-Wall/timingleaks/crypto_aead/ascon80pqv12/esp32/work/./try.c:476:(.text+0x...): undefined reference to `crypto_aead_ascon80pqv12_esp32_timingleaks_decrypt'
try.c: /usr/bin/ld: .../supercop-data/thinksky/amd64/try/c/clang_-march=native_-O3_-fwrapv_-Qunused-arguments_-fPIC_-fPIE_-gdwarf-4_-Wall/timingleaks/crypto_aead/ascon80pqv12/esp32/work/./try.c:480:(.text+0x...): undefined reference to `crypto_aead_ascon80pqv12_esp32_timingleaks_decrypt'
try.c: /usr/bin/ld: .../supercop-data/thinksky/amd64/try/c/clang_-march=native_-O3_-fwrapv_-Qunused-arguments_-fPIC_-fPIE_-gdwarf-4_-Wall/timingleaks/crypto_aead/ascon80pqv12/esp32/work/./try.c:484:(.text+0x...): undefined reference to `crypto_aead_ascon80pqv12_esp32_timingleaks_decrypt'
try.c: clang: error: linker command failed with exit code 1 (use -v to see invocation)

Number of similar (implementation,compiler) pairs: 1, namely:
ImplementationCompiler
T:esp32clang -march=native -O3 -fwrapv -Qunused-arguments -fPIC -fPIE -gdwarf-4 -Wall (Debian_Clang_19.1.7_(3+b1))

Compiler output


try.c: /usr/bin/ld: /tmp/try-small-6cb1ad.o: in function `doit':
try.c: .../supercop-data/thinksky/amd64/try/c/clang_-march=native_-O_-fwrapv_-Qunused-arguments_-fPIC_-fPIE_-gdwarf-4_-Wall/timingleaks/crypto_aead/ascon80pqv12/esp32/work/./try.c:133:(.text+0x...): undefined reference to `crypto_aead_ascon80pqv12_esp32_timingleaks_encrypt'
try.c: /usr/bin/ld: .../supercop-data/thinksky/amd64/try/c/clang_-march=native_-O_-fwrapv_-Qunused-arguments_-fPIC_-fPIE_-gdwarf-4_-Wall/timingleaks/crypto_aead/ascon80pqv12/esp32/work/./try.c:135:(.text+0x...): undefined reference to `crypto_aead_ascon80pqv12_esp32_timingleaks_decrypt'
try.c: /usr/bin/ld: /tmp/try-small-6cb1ad.o: in function `test':
try.c: .../supercop-data/thinksky/amd64/try/c/clang_-march=native_-O_-fwrapv_-Qunused-arguments_-fPIC_-fPIE_-gdwarf-4_-Wall/timingleaks/crypto_aead/ascon80pqv12/esp32/work/./try.c:159:(.text+0x...): undefined reference to `crypto_aead_ascon80pqv12_esp32_timingleaks_encrypt'
try.c: /usr/bin/ld: .../supercop-data/thinksky/amd64/try/c/clang_-march=native_-O_-fwrapv_-Qunused-arguments_-fPIC_-fPIE_-gdwarf-4_-Wall/timingleaks/crypto_aead/ascon80pqv12/esp32/work/./try.c:189:(.text+0x...): undefined reference to `crypto_aead_ascon80pqv12_esp32_timingleaks_encrypt'
try.c: /usr/bin/ld: .../supercop-data/thinksky/amd64/try/c/clang_-march=native_-O_-fwrapv_-Qunused-arguments_-fPIC_-fPIE_-gdwarf-4_-Wall/timingleaks/crypto_aead/ascon80pqv12/esp32/work/./try.c:300:(.text+0x...): undefined reference to `crypto_aead_ascon80pqv12_esp32_timingleaks_decrypt'
try.c: /usr/bin/ld: .../supercop-data/thinksky/amd64/try/c/clang_-march=native_-O_-fwrapv_-Qunused-arguments_-fPIC_-fPIE_-gdwarf-4_-Wall/timingleaks/crypto_aead/ascon80pqv12/esp32/work/./try.c:331:(.text+0x...): undefined reference to `crypto_aead_ascon80pqv12_esp32_timingleaks_decrypt'
try.c: /usr/bin/ld: .../supercop-data/thinksky/amd64/try/c/clang_-march=native_-O_-fwrapv_-Qunused-arguments_-fPIC_-fPIE_-gdwarf-4_-Wall/timingleaks/crypto_aead/ascon80pqv12/esp32/work/./try.c:476:(.text+0x...): undefined reference to `crypto_aead_ascon80pqv12_esp32_timingleaks_decrypt'
try.c: /usr/bin/ld: .../supercop-data/thinksky/amd64/try/c/clang_-march=native_-O_-fwrapv_-Qunused-arguments_-fPIC_-fPIE_-gdwarf-4_-Wall/timingleaks/crypto_aead/ascon80pqv12/esp32/work/./try.c:480:(.text+0x...): undefined reference to `crypto_aead_ascon80pqv12_esp32_timingleaks_decrypt'
try.c: /usr/bin/ld: .../supercop-data/thinksky/amd64/try/c/clang_-march=native_-O_-fwrapv_-Qunused-arguments_-fPIC_-fPIE_-gdwarf-4_-Wall/timingleaks/crypto_aead/ascon80pqv12/esp32/work/./try.c:484:(.text+0x...): undefined reference to `crypto_aead_ascon80pqv12_esp32_timingleaks_decrypt'
try.c: clang: error: linker command failed with exit code 1 (use -v to see invocation)

Number of similar (implementation,compiler) pairs: 1, namely:
ImplementationCompiler
T:esp32clang -march=native -O -fwrapv -Qunused-arguments -fPIC -fPIE -gdwarf-4 -Wall (Debian_Clang_19.1.7_(3+b1))

Compiler output


try.c: /usr/bin/ld: /tmp/try-small-e7688e.o: in function `doit':
try.c: .../supercop-data/thinksky/amd64/try/c/clang_-march=native_-Os_-fwrapv_-Qunused-arguments_-fPIC_-fPIE_-gdwarf-4_-Wall/timingleaks/crypto_aead/ascon80pqv12/esp32/work/./try.c:133:(.text+0x...): undefined reference to `crypto_aead_ascon80pqv12_esp32_timingleaks_encrypt'
try.c: /usr/bin/ld: .../supercop-data/thinksky/amd64/try/c/clang_-march=native_-Os_-fwrapv_-Qunused-arguments_-fPIC_-fPIE_-gdwarf-4_-Wall/timingleaks/crypto_aead/ascon80pqv12/esp32/work/./try.c:135:(.text+0x...): undefined reference to `crypto_aead_ascon80pqv12_esp32_timingleaks_decrypt'
try.c: /usr/bin/ld: /tmp/try-small-e7688e.o: in function `test':
try.c: .../supercop-data/thinksky/amd64/try/c/clang_-march=native_-Os_-fwrapv_-Qunused-arguments_-fPIC_-fPIE_-gdwarf-4_-Wall/timingleaks/crypto_aead/ascon80pqv12/esp32/work/./try.c:159:(.text+0x...): undefined reference to `crypto_aead_ascon80pqv12_esp32_timingleaks_encrypt'
try.c: /usr/bin/ld: .../supercop-data/thinksky/amd64/try/c/clang_-march=native_-Os_-fwrapv_-Qunused-arguments_-fPIC_-fPIE_-gdwarf-4_-Wall/timingleaks/crypto_aead/ascon80pqv12/esp32/work/./try.c:189:(.text+0x...): undefined reference to `crypto_aead_ascon80pqv12_esp32_timingleaks_encrypt'
try.c: /usr/bin/ld: .../supercop-data/thinksky/amd64/try/c/clang_-march=native_-Os_-fwrapv_-Qunused-arguments_-fPIC_-fPIE_-gdwarf-4_-Wall/timingleaks/crypto_aead/ascon80pqv12/esp32/work/./try.c:300:(.text+0x...): undefined reference to `crypto_aead_ascon80pqv12_esp32_timingleaks_decrypt'
try.c: /usr/bin/ld: .../supercop-data/thinksky/amd64/try/c/clang_-march=native_-Os_-fwrapv_-Qunused-arguments_-fPIC_-fPIE_-gdwarf-4_-Wall/timingleaks/crypto_aead/ascon80pqv12/esp32/work/./try.c:331:(.text+0x...): undefined reference to `crypto_aead_ascon80pqv12_esp32_timingleaks_decrypt'
try.c: /usr/bin/ld: .../supercop-data/thinksky/amd64/try/c/clang_-march=native_-Os_-fwrapv_-Qunused-arguments_-fPIC_-fPIE_-gdwarf-4_-Wall/timingleaks/crypto_aead/ascon80pqv12/esp32/work/./try.c:476:(.text+0x...): undefined reference to `crypto_aead_ascon80pqv12_esp32_timingleaks_decrypt'
try.c: /usr/bin/ld: .../supercop-data/thinksky/amd64/try/c/clang_-march=native_-Os_-fwrapv_-Qunused-arguments_-fPIC_-fPIE_-gdwarf-4_-Wall/timingleaks/crypto_aead/ascon80pqv12/esp32/work/./try.c:480:(.text+0x...): undefined reference to `crypto_aead_ascon80pqv12_esp32_timingleaks_decrypt'
try.c: /usr/bin/ld: .../supercop-data/thinksky/amd64/try/c/clang_-march=native_-Os_-fwrapv_-Qunused-arguments_-fPIC_-fPIE_-gdwarf-4_-Wall/timingleaks/crypto_aead/ascon80pqv12/esp32/work/./try.c:484:(.text+0x...): undefined reference to `crypto_aead_ascon80pqv12_esp32_timingleaks_decrypt'
try.c: clang: error: linker command failed with exit code 1 (use -v to see invocation)

Number of similar (implementation,compiler) pairs: 1, namely:
ImplementationCompiler
T:esp32clang -march=native -Os -fwrapv -Qunused-arguments -fPIC -fPIE -gdwarf-4 -Wall (Debian_Clang_19.1.7_(3+b1))

Compiler output


try.c: /usr/bin/ld: /tmp/try-small-674655.o: in function `doit':
try.c: .../supercop-data/thinksky/amd64/try/c/clang_-mcpu=native_-O3_-fwrapv_-Qunused-arguments_-fPIC_-fPIE_-gdwarf-4_-Wall/timingleaks/crypto_aead/ascon80pqv12/esp32/work/./try.c:133:(.text+0x...): undefined reference to `crypto_aead_ascon80pqv12_esp32_timingleaks_encrypt'
try.c: /usr/bin/ld: .../supercop-data/thinksky/amd64/try/c/clang_-mcpu=native_-O3_-fwrapv_-Qunused-arguments_-fPIC_-fPIE_-gdwarf-4_-Wall/timingleaks/crypto_aead/ascon80pqv12/esp32/work/./try.c:135:(.text+0x...): undefined reference to `crypto_aead_ascon80pqv12_esp32_timingleaks_decrypt'
try.c: /usr/bin/ld: /tmp/try-small-674655.o: in function `test':
try.c: .../supercop-data/thinksky/amd64/try/c/clang_-mcpu=native_-O3_-fwrapv_-Qunused-arguments_-fPIC_-fPIE_-gdwarf-4_-Wall/timingleaks/crypto_aead/ascon80pqv12/esp32/work/./try.c:159:(.text+0x...): undefined reference to `crypto_aead_ascon80pqv12_esp32_timingleaks_encrypt'
try.c: /usr/bin/ld: .../supercop-data/thinksky/amd64/try/c/clang_-mcpu=native_-O3_-fwrapv_-Qunused-arguments_-fPIC_-fPIE_-gdwarf-4_-Wall/timingleaks/crypto_aead/ascon80pqv12/esp32/work/./try.c:189:(.text+0x...): undefined reference to `crypto_aead_ascon80pqv12_esp32_timingleaks_encrypt'
try.c: /usr/bin/ld: .../supercop-data/thinksky/amd64/try/c/clang_-mcpu=native_-O3_-fwrapv_-Qunused-arguments_-fPIC_-fPIE_-gdwarf-4_-Wall/timingleaks/crypto_aead/ascon80pqv12/esp32/work/./try.c:300:(.text+0x...): undefined reference to `crypto_aead_ascon80pqv12_esp32_timingleaks_decrypt'
try.c: /usr/bin/ld: .../supercop-data/thinksky/amd64/try/c/clang_-mcpu=native_-O3_-fwrapv_-Qunused-arguments_-fPIC_-fPIE_-gdwarf-4_-Wall/timingleaks/crypto_aead/ascon80pqv12/esp32/work/./try.c:331:(.text+0x...): undefined reference to `crypto_aead_ascon80pqv12_esp32_timingleaks_decrypt'
try.c: /usr/bin/ld: .../supercop-data/thinksky/amd64/try/c/clang_-mcpu=native_-O3_-fwrapv_-Qunused-arguments_-fPIC_-fPIE_-gdwarf-4_-Wall/timingleaks/crypto_aead/ascon80pqv12/esp32/work/./try.c:476:(.text+0x...): undefined reference to `crypto_aead_ascon80pqv12_esp32_timingleaks_decrypt'
try.c: /usr/bin/ld: .../supercop-data/thinksky/amd64/try/c/clang_-mcpu=native_-O3_-fwrapv_-Qunused-arguments_-fPIC_-fPIE_-gdwarf-4_-Wall/timingleaks/crypto_aead/ascon80pqv12/esp32/work/./try.c:480:(.text+0x...): undefined reference to `crypto_aead_ascon80pqv12_esp32_timingleaks_decrypt'
try.c: /usr/bin/ld: .../supercop-data/thinksky/amd64/try/c/clang_-mcpu=native_-O3_-fwrapv_-Qunused-arguments_-fPIC_-fPIE_-gdwarf-4_-Wall/timingleaks/crypto_aead/ascon80pqv12/esp32/work/./try.c:484:(.text+0x...): undefined reference to `crypto_aead_ascon80pqv12_esp32_timingleaks_decrypt'
try.c: clang: error: linker command failed with exit code 1 (use -v to see invocation)

Number of similar (implementation,compiler) pairs: 1, namely:
ImplementationCompiler
T:esp32clang -mcpu=native -O3 -fwrapv -Qunused-arguments -fPIC -fPIE -gdwarf-4 -Wall (Debian_Clang_19.1.7_(3+b1))

Compiler output


try.c: /usr/bin/ld: /tmp/ccHLICI9.o: in function `doit':
try.c: .../supercop-data/thinksky/amd64/try/c/gcc_-march=native_-mtune=native_-O2_-fwrapv_-fPIC_-fPIE_-gdwarf-4_-Wall/timingleaks/crypto_aead/ascon80pqv12/esp32/work/try.c:133:(.text+0x...): undefined reference to `crypto_aead_ascon80pqv12_esp32_timingleaks_encrypt'
try.c: /usr/bin/ld: .../supercop-data/thinksky/amd64/try/c/gcc_-march=native_-mtune=native_-O2_-fwrapv_-fPIC_-fPIE_-gdwarf-4_-Wall/timingleaks/crypto_aead/ascon80pqv12/esp32/work/try.c:135:(.text+0x...): undefined reference to `crypto_aead_ascon80pqv12_esp32_timingleaks_decrypt'
try.c: /usr/bin/ld: /tmp/ccHLICI9.o: in function `test':
try.c: .../supercop-data/thinksky/amd64/try/c/gcc_-march=native_-mtune=native_-O2_-fwrapv_-fPIC_-fPIE_-gdwarf-4_-Wall/timingleaks/crypto_aead/ascon80pqv12/esp32/work/try.c:189:(.text+0x...): undefined reference to `crypto_aead_ascon80pqv12_esp32_timingleaks_encrypt'
try.c: /usr/bin/ld: .../supercop-data/thinksky/amd64/try/c/gcc_-march=native_-mtune=native_-O2_-fwrapv_-fPIC_-fPIE_-gdwarf-4_-Wall/timingleaks/crypto_aead/ascon80pqv12/esp32/work/try.c:300:(.text+0x...): undefined reference to `crypto_aead_ascon80pqv12_esp32_timingleaks_decrypt'
try.c: /usr/bin/ld: .../supercop-data/thinksky/amd64/try/c/gcc_-march=native_-mtune=native_-O2_-fwrapv_-fPIC_-fPIE_-gdwarf-4_-Wall/timingleaks/crypto_aead/ascon80pqv12/esp32/work/try.c:331:(.text+0x...): undefined reference to `crypto_aead_ascon80pqv12_esp32_timingleaks_decrypt'
try.c: /usr/bin/ld: .../supercop-data/thinksky/amd64/try/c/gcc_-march=native_-mtune=native_-O2_-fwrapv_-fPIC_-fPIE_-gdwarf-4_-Wall/timingleaks/crypto_aead/ascon80pqv12/esp32/work/try.c:476:(.text+0x...): undefined reference to `crypto_aead_ascon80pqv12_esp32_timingleaks_decrypt'
try.c: /usr/bin/ld: .../supercop-data/thinksky/amd64/try/c/gcc_-march=native_-mtune=native_-O2_-fwrapv_-fPIC_-fPIE_-gdwarf-4_-Wall/timingleaks/crypto_aead/ascon80pqv12/esp32/work/try.c:480:(.text+0x...): undefined reference to `crypto_aead_ascon80pqv12_esp32_timingleaks_decrypt'
try.c: /usr/bin/ld: .../supercop-data/thinksky/amd64/try/c/gcc_-march=native_-mtune=native_-O2_-fwrapv_-fPIC_-fPIE_-gdwarf-4_-Wall/timingleaks/crypto_aead/ascon80pqv12/esp32/work/try.c:484:(.text+0x...): undefined reference to `crypto_aead_ascon80pqv12_esp32_timingleaks_decrypt'
try.c: /usr/bin/ld: .../supercop-data/thinksky/amd64/try/c/gcc_-march=native_-mtune=native_-O2_-fwrapv_-fPIC_-fPIE_-gdwarf-4_-Wall/timingleaks/crypto_aead/ascon80pqv12/esp32/work/try.c:159:(.text+0x...): undefined reference to `crypto_aead_ascon80pqv12_esp32_timingleaks_encrypt'
try.c: collect2: error: ld returned 1 exit status

Number of similar (implementation,compiler) pairs: 1, namely:
ImplementationCompiler
T:esp32gcc -march=native -mtune=native -O2 -fwrapv -fPIC -fPIE -gdwarf-4 -Wall (14.2.0)

Compiler output


try.c: /usr/bin/ld: /tmp/ccTw3Jsc.o: in function `doit':
try.c: .../supercop-data/thinksky/amd64/try/c/gcc_-march=native_-mtune=native_-O3_-fwrapv_-fPIC_-fPIE_-gdwarf-4_-Wall/timingleaks/crypto_aead/ascon80pqv12/esp32/work/try.c:133:(.text+0x...): undefined reference to `crypto_aead_ascon80pqv12_esp32_timingleaks_encrypt'
try.c: /usr/bin/ld: .../supercop-data/thinksky/amd64/try/c/gcc_-march=native_-mtune=native_-O3_-fwrapv_-fPIC_-fPIE_-gdwarf-4_-Wall/timingleaks/crypto_aead/ascon80pqv12/esp32/work/try.c:135:(.text+0x...): undefined reference to `crypto_aead_ascon80pqv12_esp32_timingleaks_decrypt'
try.c: /usr/bin/ld: /tmp/ccTw3Jsc.o: in function `test':
try.c: .../supercop-data/thinksky/amd64/try/c/gcc_-march=native_-mtune=native_-O3_-fwrapv_-fPIC_-fPIE_-gdwarf-4_-Wall/timingleaks/crypto_aead/ascon80pqv12/esp32/work/try.c:189:(.text+0x...): undefined reference to `crypto_aead_ascon80pqv12_esp32_timingleaks_encrypt'
try.c: /usr/bin/ld: .../supercop-data/thinksky/amd64/try/c/gcc_-march=native_-mtune=native_-O3_-fwrapv_-fPIC_-fPIE_-gdwarf-4_-Wall/timingleaks/crypto_aead/ascon80pqv12/esp32/work/try.c:300:(.text+0x...): undefined reference to `crypto_aead_ascon80pqv12_esp32_timingleaks_decrypt'
try.c: /usr/bin/ld: .../supercop-data/thinksky/amd64/try/c/gcc_-march=native_-mtune=native_-O3_-fwrapv_-fPIC_-fPIE_-gdwarf-4_-Wall/timingleaks/crypto_aead/ascon80pqv12/esp32/work/try.c:331:(.text+0x...): undefined reference to `crypto_aead_ascon80pqv12_esp32_timingleaks_decrypt'
try.c: /usr/bin/ld: .../supercop-data/thinksky/amd64/try/c/gcc_-march=native_-mtune=native_-O3_-fwrapv_-fPIC_-fPIE_-gdwarf-4_-Wall/timingleaks/crypto_aead/ascon80pqv12/esp32/work/try.c:476:(.text+0x...): undefined reference to `crypto_aead_ascon80pqv12_esp32_timingleaks_decrypt'
try.c: /usr/bin/ld: .../supercop-data/thinksky/amd64/try/c/gcc_-march=native_-mtune=native_-O3_-fwrapv_-fPIC_-fPIE_-gdwarf-4_-Wall/timingleaks/crypto_aead/ascon80pqv12/esp32/work/try.c:480:(.text+0x...): undefined reference to `crypto_aead_ascon80pqv12_esp32_timingleaks_decrypt'
try.c: /usr/bin/ld: .../supercop-data/thinksky/amd64/try/c/gcc_-march=native_-mtune=native_-O3_-fwrapv_-fPIC_-fPIE_-gdwarf-4_-Wall/timingleaks/crypto_aead/ascon80pqv12/esp32/work/try.c:484:(.text+0x...): undefined reference to `crypto_aead_ascon80pqv12_esp32_timingleaks_decrypt'
try.c: /usr/bin/ld: .../supercop-data/thinksky/amd64/try/c/gcc_-march=native_-mtune=native_-O3_-fwrapv_-fPIC_-fPIE_-gdwarf-4_-Wall/timingleaks/crypto_aead/ascon80pqv12/esp32/work/try.c:159:(.text+0x...): undefined reference to `crypto_aead_ascon80pqv12_esp32_timingleaks_encrypt'
try.c: collect2: error: ld returned 1 exit status

Number of similar (implementation,compiler) pairs: 1, namely:
ImplementationCompiler
T:esp32gcc -march=native -mtune=native -O3 -fwrapv -fPIC -fPIE -gdwarf-4 -Wall (14.2.0)

Compiler output


try.c: /usr/bin/ld: /tmp/ccR3Bmi8.o: in function `doit':
try.c: .../supercop-data/thinksky/amd64/try/c/gcc_-march=native_-mtune=native_-O_-fwrapv_-fPIC_-fPIE_-gdwarf-4_-Wall/timingleaks/crypto_aead/ascon80pqv12/esp32/work/try.c:133:(.text+0x...): undefined reference to `crypto_aead_ascon80pqv12_esp32_timingleaks_encrypt'
try.c: /usr/bin/ld: .../supercop-data/thinksky/amd64/try/c/gcc_-march=native_-mtune=native_-O_-fwrapv_-fPIC_-fPIE_-gdwarf-4_-Wall/timingleaks/crypto_aead/ascon80pqv12/esp32/work/try.c:135:(.text+0x...): undefined reference to `crypto_aead_ascon80pqv12_esp32_timingleaks_decrypt'
try.c: /usr/bin/ld: /tmp/ccR3Bmi8.o: in function `test':
try.c: .../supercop-data/thinksky/amd64/try/c/gcc_-march=native_-mtune=native_-O_-fwrapv_-fPIC_-fPIE_-gdwarf-4_-Wall/timingleaks/crypto_aead/ascon80pqv12/esp32/work/try.c:159:(.text+0x...): undefined reference to `crypto_aead_ascon80pqv12_esp32_timingleaks_encrypt'
try.c: /usr/bin/ld: .../supercop-data/thinksky/amd64/try/c/gcc_-march=native_-mtune=native_-O_-fwrapv_-fPIC_-fPIE_-gdwarf-4_-Wall/timingleaks/crypto_aead/ascon80pqv12/esp32/work/try.c:189:(.text+0x...): undefined reference to `crypto_aead_ascon80pqv12_esp32_timingleaks_encrypt'
try.c: /usr/bin/ld: .../supercop-data/thinksky/amd64/try/c/gcc_-march=native_-mtune=native_-O_-fwrapv_-fPIC_-fPIE_-gdwarf-4_-Wall/timingleaks/crypto_aead/ascon80pqv12/esp32/work/try.c:300:(.text+0x...): undefined reference to `crypto_aead_ascon80pqv12_esp32_timingleaks_decrypt'
try.c: /usr/bin/ld: .../supercop-data/thinksky/amd64/try/c/gcc_-march=native_-mtune=native_-O_-fwrapv_-fPIC_-fPIE_-gdwarf-4_-Wall/timingleaks/crypto_aead/ascon80pqv12/esp32/work/try.c:331:(.text+0x...): undefined reference to `crypto_aead_ascon80pqv12_esp32_timingleaks_decrypt'
try.c: /usr/bin/ld: .../supercop-data/thinksky/amd64/try/c/gcc_-march=native_-mtune=native_-O_-fwrapv_-fPIC_-fPIE_-gdwarf-4_-Wall/timingleaks/crypto_aead/ascon80pqv12/esp32/work/try.c:476:(.text+0x...): undefined reference to `crypto_aead_ascon80pqv12_esp32_timingleaks_decrypt'
try.c: /usr/bin/ld: .../supercop-data/thinksky/amd64/try/c/gcc_-march=native_-mtune=native_-O_-fwrapv_-fPIC_-fPIE_-gdwarf-4_-Wall/timingleaks/crypto_aead/ascon80pqv12/esp32/work/try.c:480:(.text+0x...): undefined reference to `crypto_aead_ascon80pqv12_esp32_timingleaks_decrypt'
try.c: /usr/bin/ld: .../supercop-data/thinksky/amd64/try/c/gcc_-march=native_-mtune=native_-O_-fwrapv_-fPIC_-fPIE_-gdwarf-4_-Wall/timingleaks/crypto_aead/ascon80pqv12/esp32/work/try.c:484:(.text+0x...): undefined reference to `crypto_aead_ascon80pqv12_esp32_timingleaks_decrypt'
try.c: collect2: error: ld returned 1 exit status

Number of similar (implementation,compiler) pairs: 1, namely:
ImplementationCompiler
T:esp32gcc -march=native -mtune=native -O -fwrapv -fPIC -fPIE -gdwarf-4 -Wall (14.2.0)

Compiler output


try.c: /usr/bin/ld: /tmp/ccfhhxUW.o: in function `doit':
try.c: .../supercop-data/thinksky/amd64/try/c/gcc_-march=native_-mtune=native_-Os_-fwrapv_-fPIC_-fPIE_-gdwarf-4_-Wall/timingleaks/crypto_aead/ascon80pqv12/esp32/work/try.c:133:(.text+0x...): undefined reference to `crypto_aead_ascon80pqv12_esp32_timingleaks_encrypt'
try.c: /usr/bin/ld: .../supercop-data/thinksky/amd64/try/c/gcc_-march=native_-mtune=native_-Os_-fwrapv_-fPIC_-fPIE_-gdwarf-4_-Wall/timingleaks/crypto_aead/ascon80pqv12/esp32/work/try.c:135:(.text+0x...): undefined reference to `crypto_aead_ascon80pqv12_esp32_timingleaks_decrypt'
try.c: /usr/bin/ld: /tmp/ccfhhxUW.o: in function `test':
try.c: .../supercop-data/thinksky/amd64/try/c/gcc_-march=native_-mtune=native_-Os_-fwrapv_-fPIC_-fPIE_-gdwarf-4_-Wall/timingleaks/crypto_aead/ascon80pqv12/esp32/work/try.c:159:(.text+0x...): undefined reference to `crypto_aead_ascon80pqv12_esp32_timingleaks_encrypt'
try.c: /usr/bin/ld: .../supercop-data/thinksky/amd64/try/c/gcc_-march=native_-mtune=native_-Os_-fwrapv_-fPIC_-fPIE_-gdwarf-4_-Wall/timingleaks/crypto_aead/ascon80pqv12/esp32/work/try.c:189:(.text+0x...): undefined reference to `crypto_aead_ascon80pqv12_esp32_timingleaks_encrypt'
try.c: /usr/bin/ld: .../supercop-data/thinksky/amd64/try/c/gcc_-march=native_-mtune=native_-Os_-fwrapv_-fPIC_-fPIE_-gdwarf-4_-Wall/timingleaks/crypto_aead/ascon80pqv12/esp32/work/try.c:300:(.text+0x...): undefined reference to `crypto_aead_ascon80pqv12_esp32_timingleaks_decrypt'
try.c: /usr/bin/ld: .../supercop-data/thinksky/amd64/try/c/gcc_-march=native_-mtune=native_-Os_-fwrapv_-fPIC_-fPIE_-gdwarf-4_-Wall/timingleaks/crypto_aead/ascon80pqv12/esp32/work/try.c:331:(.text+0x...): undefined reference to `crypto_aead_ascon80pqv12_esp32_timingleaks_decrypt'
try.c: /usr/bin/ld: .../supercop-data/thinksky/amd64/try/c/gcc_-march=native_-mtune=native_-Os_-fwrapv_-fPIC_-fPIE_-gdwarf-4_-Wall/timingleaks/crypto_aead/ascon80pqv12/esp32/work/try.c:476:(.text+0x...): undefined reference to `crypto_aead_ascon80pqv12_esp32_timingleaks_decrypt'
try.c: /usr/bin/ld: .../supercop-data/thinksky/amd64/try/c/gcc_-march=native_-mtune=native_-Os_-fwrapv_-fPIC_-fPIE_-gdwarf-4_-Wall/timingleaks/crypto_aead/ascon80pqv12/esp32/work/try.c:480:(.text+0x...): undefined reference to `crypto_aead_ascon80pqv12_esp32_timingleaks_decrypt'
try.c: /usr/bin/ld: .../supercop-data/thinksky/amd64/try/c/gcc_-march=native_-mtune=native_-Os_-fwrapv_-fPIC_-fPIE_-gdwarf-4_-Wall/timingleaks/crypto_aead/ascon80pqv12/esp32/work/try.c:484:(.text+0x...): undefined reference to `crypto_aead_ascon80pqv12_esp32_timingleaks_decrypt'
try.c: collect2: error: ld returned 1 exit status

Number of similar (implementation,compiler) pairs: 1, namely:
ImplementationCompiler
T:esp32gcc -march=native -mtune=native -Os -fwrapv -fPIC -fPIE -gdwarf-4 -Wall (14.2.0)

Compiler output


aead.c: In file included from round.h:8,
aead.c:                  from permutations.h:11,
aead.c:                  from aead.c:5:
aead.c: In function 'memxor',
aead.c:     inlined from 'ascon_final' at aead.c:147:3:
aead.c: word.h:102:12: warning: writing 1 byte into a region of size 0 [-Wstringop-overflow=]
aead.c:   102 |     *dst++ ^= *src++;
aead.c:       |            ^~
aead.c: aead.c: In function 'ascon_final':
aead.c: aead.c:134:45: note: at offset 32 into destination object 's' of size [0, 32]
aead.c:   134 | forceinline void ascon_final(ascon_state_t* s, const ascon_key_t* key) {
aead.c:       |                              ~~~~~~~~~~~~~~~^
aead.c: In function 'memxor',
aead.c:     inlined from 'ascon_final' at aead.c:147:3:
aead.c: word.h:102:12: warning: writing 1 byte into a region of size 0 [-Wstringop-overflow=]
aead.c:   102 |     *dst++ ^= *src++;
aead.c:       |            ^~
aead.c: aead.c: In function 'ascon_final':
aead.c: aead.c:134:45: note: at offset 33 into destination object 's' of size [0, 32]
aead.c:   134 | forceinline void ascon_final(ascon_state_t* s, const ascon_key_t* key) {
aead.c:       |                              ~~~~~~~~~~~~~~~^
aead.c: In function 'memxor',
aead.c:     inlined from 'ascon_final' at aead.c:147:3:
aead.c: word.h:102:12: warning: writing 1 byte into a region of size 0 [-Wstringop-overflow=]
aead.c:   102 |     *dst++ ^= *src++;
aead.c: ...

Number of similar (implementation,compiler) pairs: 1, namely:
ImplementationCompiler
opt8gcc -march=native -mtune=native -O3 -fwrapv -fPIC -fPIE -gdwarf-4 -Wall (14.2.0)

Compiler output


aead.c: In file included from round.h:8,
aead.c:                  from permutations.h:11,
aead.c:                  from aead.c:5:
aead.c: In function 'memxor',
aead.c:     inlined from 'ascon_final' at aead.c:62:3:
aead.c: word.h:102:12: warning: writing 1 byte into a region of size 0 [-Wstringop-overflow=]
aead.c:   102 |     *dst++ ^= *src++;
aead.c:       |            ^~
aead.c: aead.c: In function 'ascon_final':
aead.c: aead.c:49:45: note: at offset 32 into destination object 's' of size [0, 32]
aead.c:    49 | forceinline void ascon_final(ascon_state_t* s, const ascon_key_t* key) {
aead.c:       |                              ~~~~~~~~~~~~~~~^
aead.c: In function 'memxor',
aead.c:     inlined from 'ascon_final' at aead.c:62:3:
aead.c: word.h:102:12: warning: writing 1 byte into a region of size 0 [-Wstringop-overflow=]
aead.c:   102 |     *dst++ ^= *src++;
aead.c:       |            ^~
aead.c: aead.c: In function 'ascon_final':
aead.c: aead.c:49:45: note: at offset 33 into destination object 's' of size [0, 32]
aead.c:    49 | forceinline void ascon_final(ascon_state_t* s, const ascon_key_t* key) {
aead.c:       |                              ~~~~~~~~~~~~~~~^
aead.c: In function 'memxor',
aead.c:     inlined from 'ascon_final' at aead.c:62:3:
aead.c: word.h:102:12: warning: writing 1 byte into a region of size 0 [-Wstringop-overflow=]
aead.c:   102 |     *dst++ ^= *src++;
aead.c: ...

Number of similar (implementation,compiler) pairs: 1, namely:
ImplementationCompiler
opt8_lowsizegcc -march=native -mtune=native -O3 -fwrapv -fPIC -fPIE -gdwarf-4 -Wall (14.2.0)

Namespace violations


constants.o constants R
interleave.o B R
permutations.o P12 T
permutations.o P6 T

Number of similar (implementation,compiler) pairs: 9, namely:
ImplementationCompiler
bi32clang -march=native -O2 -fwrapv -Qunused-arguments -fPIC -fPIE -gdwarf-4 -Wall (Debian_Clang_19.1.7_(3+b1))
bi32clang -march=native -O3 -fwrapv -Qunused-arguments -fPIC -fPIE -gdwarf-4 -Wall (Debian_Clang_19.1.7_(3+b1))
bi32clang -march=native -O -fwrapv -Qunused-arguments -fPIC -fPIE -gdwarf-4 -Wall (Debian_Clang_19.1.7_(3+b1))
bi32clang -march=native -Os -fwrapv -Qunused-arguments -fPIC -fPIE -gdwarf-4 -Wall (Debian_Clang_19.1.7_(3+b1))
bi32clang -mcpu=native -O3 -fwrapv -Qunused-arguments -fPIC -fPIE -gdwarf-4 -Wall (Debian_Clang_19.1.7_(3+b1))
bi32gcc -march=native -mtune=native -O2 -fwrapv -fPIC -fPIE -gdwarf-4 -Wall (14.2.0)
bi32gcc -march=native -mtune=native -O3 -fwrapv -fPIC -fPIE -gdwarf-4 -Wall (14.2.0)
bi32gcc -march=native -mtune=native -O -fwrapv -fPIC -fPIE -gdwarf-4 -Wall (14.2.0)
bi32gcc -march=native -mtune=native -Os -fwrapv -fPIC -fPIE -gdwarf-4 -Wall (14.2.0)

Namespace violations


aead.o ascon_adata T
aead.o ascon_decrypt T
aead.o ascon_encrypt T
aead.o ascon_final T
aead.o ascon_initaead T
aead.o ascon_loadkey T
constants.o constants R
interleave.o B R

Number of similar (implementation,compiler) pairs: 9, namely:
ImplementationCompiler
bi32_lowregclang -march=native -O2 -fwrapv -Qunused-arguments -fPIC -fPIE -gdwarf-4 -Wall (Debian_Clang_19.1.7_(3+b1))
bi32_lowregclang -march=native -O3 -fwrapv -Qunused-arguments -fPIC -fPIE -gdwarf-4 -Wall (Debian_Clang_19.1.7_(3+b1))
bi32_lowregclang -march=native -O -fwrapv -Qunused-arguments -fPIC -fPIE -gdwarf-4 -Wall (Debian_Clang_19.1.7_(3+b1))
bi32_lowregclang -march=native -Os -fwrapv -Qunused-arguments -fPIC -fPIE -gdwarf-4 -Wall (Debian_Clang_19.1.7_(3+b1))
bi32_lowregclang -mcpu=native -O3 -fwrapv -Qunused-arguments -fPIC -fPIE -gdwarf-4 -Wall (Debian_Clang_19.1.7_(3+b1))
bi32_lowreggcc -march=native -mtune=native -O2 -fwrapv -fPIC -fPIE -gdwarf-4 -Wall (14.2.0)
bi32_lowreggcc -march=native -mtune=native -O3 -fwrapv -fPIC -fPIE -gdwarf-4 -Wall (14.2.0)
bi32_lowreggcc -march=native -mtune=native -O -fwrapv -fPIC -fPIE -gdwarf-4 -Wall (14.2.0)
bi32_lowreggcc -march=native -mtune=native -Os -fwrapv -fPIC -fPIE -gdwarf-4 -Wall (14.2.0)

Namespace violations


aead.o ascon_aead T
constants.o constants R
interleave.o B R
interleave.o FROMBI T
interleave.o TOBI T
permutations.o P T
update.o ascon_update T

Number of similar (implementation,compiler) pairs: 9, namely:
ImplementationCompiler
bi32_lowsizeclang -march=native -O2 -fwrapv -Qunused-arguments -fPIC -fPIE -gdwarf-4 -Wall (Debian_Clang_19.1.7_(3+b1))
bi32_lowsizeclang -march=native -O3 -fwrapv -Qunused-arguments -fPIC -fPIE -gdwarf-4 -Wall (Debian_Clang_19.1.7_(3+b1))
bi32_lowsizeclang -march=native -O -fwrapv -Qunused-arguments -fPIC -fPIE -gdwarf-4 -Wall (Debian_Clang_19.1.7_(3+b1))
bi32_lowsizeclang -march=native -Os -fwrapv -Qunused-arguments -fPIC -fPIE -gdwarf-4 -Wall (Debian_Clang_19.1.7_(3+b1))
bi32_lowsizeclang -mcpu=native -O3 -fwrapv -Qunused-arguments -fPIC -fPIE -gdwarf-4 -Wall (Debian_Clang_19.1.7_(3+b1))
bi32_lowsizegcc -march=native -mtune=native -O2 -fwrapv -fPIC -fPIE -gdwarf-4 -Wall (14.2.0)
bi32_lowsizegcc -march=native -mtune=native -O3 -fwrapv -fPIC -fPIE -gdwarf-4 -Wall (14.2.0)
bi32_lowsizegcc -march=native -mtune=native -O -fwrapv -fPIC -fPIE -gdwarf-4 -Wall (14.2.0)
bi32_lowsizegcc -march=native -mtune=native -Os -fwrapv -fPIC -fPIE -gdwarf-4 -Wall (14.2.0)

Namespace violations


constants.o constants R
interleave.o FROMBI T
interleave.o TOBI T
permutations.o P T

Number of similar (implementation,compiler) pairs: 9, namely:
ImplementationCompiler
bi8clang -march=native -O2 -fwrapv -Qunused-arguments -fPIC -fPIE -gdwarf-4 -Wall (Debian_Clang_19.1.7_(3+b1))
bi8clang -march=native -O3 -fwrapv -Qunused-arguments -fPIC -fPIE -gdwarf-4 -Wall (Debian_Clang_19.1.7_(3+b1))
bi8clang -march=native -O -fwrapv -Qunused-arguments -fPIC -fPIE -gdwarf-4 -Wall (Debian_Clang_19.1.7_(3+b1))
bi8clang -march=native -Os -fwrapv -Qunused-arguments -fPIC -fPIE -gdwarf-4 -Wall (Debian_Clang_19.1.7_(3+b1))
bi8clang -mcpu=native -O3 -fwrapv -Qunused-arguments -fPIC -fPIE -gdwarf-4 -Wall (Debian_Clang_19.1.7_(3+b1))
bi8gcc -march=native -mtune=native -O2 -fwrapv -fPIC -fPIE -gdwarf-4 -Wall (14.2.0)
bi8gcc -march=native -mtune=native -O3 -fwrapv -fPIC -fPIE -gdwarf-4 -Wall (14.2.0)
bi8gcc -march=native -mtune=native -O -fwrapv -fPIC -fPIE -gdwarf-4 -Wall (14.2.0)
bi8gcc -march=native -mtune=native -Os -fwrapv -fPIC -fPIE -gdwarf-4 -Wall (14.2.0)

Namespace violations


aead.o ascon_aead T
permutations.o P T
update.o ascon_update T

Number of similar (implementation,compiler) pairs: 18, namely:
ImplementationCompiler
opt32_lowsizeclang -march=native -O2 -fwrapv -Qunused-arguments -fPIC -fPIE -gdwarf-4 -Wall (Debian_Clang_19.1.7_(3+b1))
opt32_lowsizeclang -march=native -O3 -fwrapv -Qunused-arguments -fPIC -fPIE -gdwarf-4 -Wall (Debian_Clang_19.1.7_(3+b1))
opt32_lowsizeclang -march=native -O -fwrapv -Qunused-arguments -fPIC -fPIE -gdwarf-4 -Wall (Debian_Clang_19.1.7_(3+b1))
opt32_lowsizeclang -march=native -Os -fwrapv -Qunused-arguments -fPIC -fPIE -gdwarf-4 -Wall (Debian_Clang_19.1.7_(3+b1))
opt32_lowsizeclang -mcpu=native -O3 -fwrapv -Qunused-arguments -fPIC -fPIE -gdwarf-4 -Wall (Debian_Clang_19.1.7_(3+b1))
opt32_lowsizegcc -march=native -mtune=native -O2 -fwrapv -fPIC -fPIE -gdwarf-4 -Wall (14.2.0)
opt32_lowsizegcc -march=native -mtune=native -O3 -fwrapv -fPIC -fPIE -gdwarf-4 -Wall (14.2.0)
opt32_lowsizegcc -march=native -mtune=native -O -fwrapv -fPIC -fPIE -gdwarf-4 -Wall (14.2.0)
opt32_lowsizegcc -march=native -mtune=native -Os -fwrapv -fPIC -fPIE -gdwarf-4 -Wall (14.2.0)
opt64_lowsizeclang -march=native -O2 -fwrapv -Qunused-arguments -fPIC -fPIE -gdwarf-4 -Wall (Debian_Clang_19.1.7_(3+b1))
opt64_lowsizeclang -march=native -O3 -fwrapv -Qunused-arguments -fPIC -fPIE -gdwarf-4 -Wall (Debian_Clang_19.1.7_(3+b1))
opt64_lowsizeclang -march=native -O -fwrapv -Qunused-arguments -fPIC -fPIE -gdwarf-4 -Wall (Debian_Clang_19.1.7_(3+b1))
opt64_lowsizeclang -march=native -Os -fwrapv -Qunused-arguments -fPIC -fPIE -gdwarf-4 -Wall (Debian_Clang_19.1.7_(3+b1))
opt64_lowsizeclang -mcpu=native -O3 -fwrapv -Qunused-arguments -fPIC -fPIE -gdwarf-4 -Wall (Debian_Clang_19.1.7_(3+b1))
opt64_lowsizegcc -march=native -mtune=native -O2 -fwrapv -fPIC -fPIE -gdwarf-4 -Wall (14.2.0)
opt64_lowsizegcc -march=native -mtune=native -O3 -fwrapv -fPIC -fPIE -gdwarf-4 -Wall (14.2.0)
opt64_lowsizegcc -march=native -mtune=native -O -fwrapv -fPIC -fPIE -gdwarf-4 -Wall (14.2.0)
opt64_lowsizegcc -march=native -mtune=native -Os -fwrapv -fPIC -fPIE -gdwarf-4 -Wall (14.2.0)

Namespace violations


aead.o ascon_adata T
aead.o ascon_decrypt T
aead.o ascon_encrypt T
aead.o ascon_final T
aead.o ascon_initaead T
aead.o ascon_loadkey T
permutations.o P T

Number of similar (implementation,compiler) pairs: 9, namely:
ImplementationCompiler
opt8clang -march=native -O2 -fwrapv -Qunused-arguments -fPIC -fPIE -gdwarf-4 -Wall (Debian_Clang_19.1.7_(3+b1))
opt8clang -march=native -O3 -fwrapv -Qunused-arguments -fPIC -fPIE -gdwarf-4 -Wall (Debian_Clang_19.1.7_(3+b1))
opt8clang -march=native -O -fwrapv -Qunused-arguments -fPIC -fPIE -gdwarf-4 -Wall (Debian_Clang_19.1.7_(3+b1))
opt8clang -march=native -Os -fwrapv -Qunused-arguments -fPIC -fPIE -gdwarf-4 -Wall (Debian_Clang_19.1.7_(3+b1))
opt8clang -mcpu=native -O3 -fwrapv -Qunused-arguments -fPIC -fPIE -gdwarf-4 -Wall (Debian_Clang_19.1.7_(3+b1))
opt8gcc -march=native -mtune=native -O2 -fwrapv -fPIC -fPIE -gdwarf-4 -Wall (14.2.0)
opt8gcc -march=native -mtune=native -O3 -fwrapv -fPIC -fPIE -gdwarf-4 -Wall (14.2.0)
opt8gcc -march=native -mtune=native -O -fwrapv -fPIC -fPIE -gdwarf-4 -Wall (14.2.0)
opt8gcc -march=native -mtune=native -Os -fwrapv -fPIC -fPIE -gdwarf-4 -Wall (14.2.0)

Namespace violations


aead.o ascon_final T
aead.o ascon_initaead T
aead.o ascon_loadkey T
permutations.o P T
update.o ascon_update T

Number of similar (implementation,compiler) pairs: 9, namely:
ImplementationCompiler
opt8_lowsizeclang -march=native -O2 -fwrapv -Qunused-arguments -fPIC -fPIE -gdwarf-4 -Wall (Debian_Clang_19.1.7_(3+b1))
opt8_lowsizeclang -march=native -O3 -fwrapv -Qunused-arguments -fPIC -fPIE -gdwarf-4 -Wall (Debian_Clang_19.1.7_(3+b1))
opt8_lowsizeclang -march=native -O -fwrapv -Qunused-arguments -fPIC -fPIE -gdwarf-4 -Wall (Debian_Clang_19.1.7_(3+b1))
opt8_lowsizeclang -march=native -Os -fwrapv -Qunused-arguments -fPIC -fPIE -gdwarf-4 -Wall (Debian_Clang_19.1.7_(3+b1))
opt8_lowsizeclang -mcpu=native -O3 -fwrapv -Qunused-arguments -fPIC -fPIE -gdwarf-4 -Wall (Debian_Clang_19.1.7_(3+b1))
opt8_lowsizegcc -march=native -mtune=native -O2 -fwrapv -fPIC -fPIE -gdwarf-4 -Wall (14.2.0)
opt8_lowsizegcc -march=native -mtune=native -O3 -fwrapv -fPIC -fPIE -gdwarf-4 -Wall (14.2.0)
opt8_lowsizegcc -march=native -mtune=native -O -fwrapv -fPIC -fPIE -gdwarf-4 -Wall (14.2.0)
opt8_lowsizegcc -march=native -mtune=native -Os -fwrapv -fPIC -fPIE -gdwarf-4 -Wall (14.2.0)

Passed TIMECOP


TIMECOP iterations: 10

Number of similar (implementation,compiler) pairs: 99, namely:
ImplementationCompiler
bi32clang -march=native -O2 -fwrapv -Qunused-arguments -fPIC -fPIE -gdwarf-4 -Wall (Debian_Clang_19.1.7_(3+b1))
bi32clang -march=native -O3 -fwrapv -Qunused-arguments -fPIC -fPIE -gdwarf-4 -Wall (Debian_Clang_19.1.7_(3+b1))
bi32clang -march=native -O -fwrapv -Qunused-arguments -fPIC -fPIE -gdwarf-4 -Wall (Debian_Clang_19.1.7_(3+b1))
bi32clang -march=native -Os -fwrapv -Qunused-arguments -fPIC -fPIE -gdwarf-4 -Wall (Debian_Clang_19.1.7_(3+b1))
bi32clang -mcpu=native -O3 -fwrapv -Qunused-arguments -fPIC -fPIE -gdwarf-4 -Wall (Debian_Clang_19.1.7_(3+b1))
bi32gcc -march=native -mtune=native -O2 -fwrapv -fPIC -fPIE -gdwarf-4 -Wall (14.2.0)
bi32gcc -march=native -mtune=native -O3 -fwrapv -fPIC -fPIE -gdwarf-4 -Wall (14.2.0)
bi32gcc -march=native -mtune=native -O -fwrapv -fPIC -fPIE -gdwarf-4 -Wall (14.2.0)
bi32gcc -march=native -mtune=native -Os -fwrapv -fPIC -fPIE -gdwarf-4 -Wall (14.2.0)
bi32_lowregclang -march=native -O2 -fwrapv -Qunused-arguments -fPIC -fPIE -gdwarf-4 -Wall (Debian_Clang_19.1.7_(3+b1))
bi32_lowregclang -march=native -O3 -fwrapv -Qunused-arguments -fPIC -fPIE -gdwarf-4 -Wall (Debian_Clang_19.1.7_(3+b1))
bi32_lowregclang -march=native -O -fwrapv -Qunused-arguments -fPIC -fPIE -gdwarf-4 -Wall (Debian_Clang_19.1.7_(3+b1))
bi32_lowregclang -march=native -Os -fwrapv -Qunused-arguments -fPIC -fPIE -gdwarf-4 -Wall (Debian_Clang_19.1.7_(3+b1))
bi32_lowregclang -mcpu=native -O3 -fwrapv -Qunused-arguments -fPIC -fPIE -gdwarf-4 -Wall (Debian_Clang_19.1.7_(3+b1))
bi32_lowreggcc -march=native -mtune=native -O2 -fwrapv -fPIC -fPIE -gdwarf-4 -Wall (14.2.0)
bi32_lowreggcc -march=native -mtune=native -O3 -fwrapv -fPIC -fPIE -gdwarf-4 -Wall (14.2.0)
bi32_lowreggcc -march=native -mtune=native -O -fwrapv -fPIC -fPIE -gdwarf-4 -Wall (14.2.0)
bi32_lowreggcc -march=native -mtune=native -Os -fwrapv -fPIC -fPIE -gdwarf-4 -Wall (14.2.0)
bi32_lowsizeclang -march=native -O2 -fwrapv -Qunused-arguments -fPIC -fPIE -gdwarf-4 -Wall (Debian_Clang_19.1.7_(3+b1))
bi32_lowsizeclang -march=native -O3 -fwrapv -Qunused-arguments -fPIC -fPIE -gdwarf-4 -Wall (Debian_Clang_19.1.7_(3+b1))
bi32_lowsizeclang -march=native -O -fwrapv -Qunused-arguments -fPIC -fPIE -gdwarf-4 -Wall (Debian_Clang_19.1.7_(3+b1))
bi32_lowsizeclang -march=native -Os -fwrapv -Qunused-arguments -fPIC -fPIE -gdwarf-4 -Wall (Debian_Clang_19.1.7_(3+b1))
bi32_lowsizeclang -mcpu=native -O3 -fwrapv -Qunused-arguments -fPIC -fPIE -gdwarf-4 -Wall (Debian_Clang_19.1.7_(3+b1))
bi32_lowsizegcc -march=native -mtune=native -O2 -fwrapv -fPIC -fPIE -gdwarf-4 -Wall (14.2.0)
bi32_lowsizegcc -march=native -mtune=native -O3 -fwrapv -fPIC -fPIE -gdwarf-4 -Wall (14.2.0)
bi32_lowsizegcc -march=native -mtune=native -O -fwrapv -fPIC -fPIE -gdwarf-4 -Wall (14.2.0)
bi32_lowsizegcc -march=native -mtune=native -Os -fwrapv -fPIC -fPIE -gdwarf-4 -Wall (14.2.0)
bi8clang -march=native -O2 -fwrapv -Qunused-arguments -fPIC -fPIE -gdwarf-4 -Wall (Debian_Clang_19.1.7_(3+b1))
bi8clang -march=native -O3 -fwrapv -Qunused-arguments -fPIC -fPIE -gdwarf-4 -Wall (Debian_Clang_19.1.7_(3+b1))
bi8clang -march=native -O -fwrapv -Qunused-arguments -fPIC -fPIE -gdwarf-4 -Wall (Debian_Clang_19.1.7_(3+b1))
bi8clang -march=native -Os -fwrapv -Qunused-arguments -fPIC -fPIE -gdwarf-4 -Wall (Debian_Clang_19.1.7_(3+b1))
bi8clang -mcpu=native -O3 -fwrapv -Qunused-arguments -fPIC -fPIE -gdwarf-4 -Wall (Debian_Clang_19.1.7_(3+b1))
bi8gcc -march=native -mtune=native -O2 -fwrapv -fPIC -fPIE -gdwarf-4 -Wall (14.2.0)
bi8gcc -march=native -mtune=native -O3 -fwrapv -fPIC -fPIE -gdwarf-4 -Wall (14.2.0)
bi8gcc -march=native -mtune=native -O -fwrapv -fPIC -fPIE -gdwarf-4 -Wall (14.2.0)
bi8gcc -march=native -mtune=native -Os -fwrapv -fPIC -fPIE -gdwarf-4 -Wall (14.2.0)
opt32clang -march=native -O2 -fwrapv -Qunused-arguments -fPIC -fPIE -gdwarf-4 -Wall (Debian_Clang_19.1.7_(3+b1))
opt32clang -march=native -O3 -fwrapv -Qunused-arguments -fPIC -fPIE -gdwarf-4 -Wall (Debian_Clang_19.1.7_(3+b1))
opt32clang -march=native -O -fwrapv -Qunused-arguments -fPIC -fPIE -gdwarf-4 -Wall (Debian_Clang_19.1.7_(3+b1))
opt32clang -march=native -Os -fwrapv -Qunused-arguments -fPIC -fPIE -gdwarf-4 -Wall (Debian_Clang_19.1.7_(3+b1))
opt32clang -mcpu=native -O3 -fwrapv -Qunused-arguments -fPIC -fPIE -gdwarf-4 -Wall (Debian_Clang_19.1.7_(3+b1))
opt32gcc -march=native -mtune=native -O2 -fwrapv -fPIC -fPIE -gdwarf-4 -Wall (14.2.0)
opt32gcc -march=native -mtune=native -O3 -fwrapv -fPIC -fPIE -gdwarf-4 -Wall (14.2.0)
opt32gcc -march=native -mtune=native -O -fwrapv -fPIC -fPIE -gdwarf-4 -Wall (14.2.0)
opt32gcc -march=native -mtune=native -Os -fwrapv -fPIC -fPIE -gdwarf-4 -Wall (14.2.0)
opt32_lowsizeclang -march=native -O2 -fwrapv -Qunused-arguments -fPIC -fPIE -gdwarf-4 -Wall (Debian_Clang_19.1.7_(3+b1))
opt32_lowsizeclang -march=native -O3 -fwrapv -Qunused-arguments -fPIC -fPIE -gdwarf-4 -Wall (Debian_Clang_19.1.7_(3+b1))
opt32_lowsizeclang -march=native -O -fwrapv -Qunused-arguments -fPIC -fPIE -gdwarf-4 -Wall (Debian_Clang_19.1.7_(3+b1))
opt32_lowsizeclang -march=native -Os -fwrapv -Qunused-arguments -fPIC -fPIE -gdwarf-4 -Wall (Debian_Clang_19.1.7_(3+b1))
opt32_lowsizeclang -mcpu=native -O3 -fwrapv -Qunused-arguments -fPIC -fPIE -gdwarf-4 -Wall (Debian_Clang_19.1.7_(3+b1))
opt32_lowsizegcc -march=native -mtune=native -O2 -fwrapv -fPIC -fPIE -gdwarf-4 -Wall (14.2.0)
opt32_lowsizegcc -march=native -mtune=native -O3 -fwrapv -fPIC -fPIE -gdwarf-4 -Wall (14.2.0)
opt32_lowsizegcc -march=native -mtune=native -O -fwrapv -fPIC -fPIE -gdwarf-4 -Wall (14.2.0)
opt32_lowsizegcc -march=native -mtune=native -Os -fwrapv -fPIC -fPIE -gdwarf-4 -Wall (14.2.0)
opt64clang -march=native -O2 -fwrapv -Qunused-arguments -fPIC -fPIE -gdwarf-4 -Wall (Debian_Clang_19.1.7_(3+b1))
opt64clang -march=native -O3 -fwrapv -Qunused-arguments -fPIC -fPIE -gdwarf-4 -Wall (Debian_Clang_19.1.7_(3+b1))
opt64clang -march=native -O -fwrapv -Qunused-arguments -fPIC -fPIE -gdwarf-4 -Wall (Debian_Clang_19.1.7_(3+b1))
opt64clang -march=native -Os -fwrapv -Qunused-arguments -fPIC -fPIE -gdwarf-4 -Wall (Debian_Clang_19.1.7_(3+b1))
opt64clang -mcpu=native -O3 -fwrapv -Qunused-arguments -fPIC -fPIE -gdwarf-4 -Wall (Debian_Clang_19.1.7_(3+b1))
opt64gcc -march=native -mtune=native -O2 -fwrapv -fPIC -fPIE -gdwarf-4 -Wall (14.2.0)
opt64gcc -march=native -mtune=native -O3 -fwrapv -fPIC -fPIE -gdwarf-4 -Wall (14.2.0)
opt64gcc -march=native -mtune=native -O -fwrapv -fPIC -fPIE -gdwarf-4 -Wall (14.2.0)
opt64gcc -march=native -mtune=native -Os -fwrapv -fPIC -fPIE -gdwarf-4 -Wall (14.2.0)
opt64_lowsizeclang -march=native -O2 -fwrapv -Qunused-arguments -fPIC -fPIE -gdwarf-4 -Wall (Debian_Clang_19.1.7_(3+b1))
opt64_lowsizeclang -march=native -O3 -fwrapv -Qunused-arguments -fPIC -fPIE -gdwarf-4 -Wall (Debian_Clang_19.1.7_(3+b1))
opt64_lowsizeclang -march=native -O -fwrapv -Qunused-arguments -fPIC -fPIE -gdwarf-4 -Wall (Debian_Clang_19.1.7_(3+b1))
opt64_lowsizeclang -march=native -Os -fwrapv -Qunused-arguments -fPIC -fPIE -gdwarf-4 -Wall (Debian_Clang_19.1.7_(3+b1))
opt64_lowsizeclang -mcpu=native -O3 -fwrapv -Qunused-arguments -fPIC -fPIE -gdwarf-4 -Wall (Debian_Clang_19.1.7_(3+b1))
opt64_lowsizegcc -march=native -mtune=native -O2 -fwrapv -fPIC -fPIE -gdwarf-4 -Wall (14.2.0)
opt64_lowsizegcc -march=native -mtune=native -O3 -fwrapv -fPIC -fPIE -gdwarf-4 -Wall (14.2.0)
opt64_lowsizegcc -march=native -mtune=native -O -fwrapv -fPIC -fPIE -gdwarf-4 -Wall (14.2.0)
opt64_lowsizegcc -march=native -mtune=native -Os -fwrapv -fPIC -fPIE -gdwarf-4 -Wall (14.2.0)
opt8clang -march=native -O2 -fwrapv -Qunused-arguments -fPIC -fPIE -gdwarf-4 -Wall (Debian_Clang_19.1.7_(3+b1))
opt8clang -march=native -O3 -fwrapv -Qunused-arguments -fPIC -fPIE -gdwarf-4 -Wall (Debian_Clang_19.1.7_(3+b1))
opt8clang -march=native -O -fwrapv -Qunused-arguments -fPIC -fPIE -gdwarf-4 -Wall (Debian_Clang_19.1.7_(3+b1))
opt8clang -march=native -Os -fwrapv -Qunused-arguments -fPIC -fPIE -gdwarf-4 -Wall (Debian_Clang_19.1.7_(3+b1))
opt8clang -mcpu=native -O3 -fwrapv -Qunused-arguments -fPIC -fPIE -gdwarf-4 -Wall (Debian_Clang_19.1.7_(3+b1))
opt8gcc -march=native -mtune=native -O2 -fwrapv -fPIC -fPIE -gdwarf-4 -Wall (14.2.0)
opt8gcc -march=native -mtune=native -O3 -fwrapv -fPIC -fPIE -gdwarf-4 -Wall (14.2.0)
opt8gcc -march=native -mtune=native -O -fwrapv -fPIC -fPIE -gdwarf-4 -Wall (14.2.0)
opt8gcc -march=native -mtune=native -Os -fwrapv -fPIC -fPIE -gdwarf-4 -Wall (14.2.0)
opt8_lowsizeclang -march=native -O2 -fwrapv -Qunused-arguments -fPIC -fPIE -gdwarf-4 -Wall (Debian_Clang_19.1.7_(3+b1))
opt8_lowsizeclang -march=native -O3 -fwrapv -Qunused-arguments -fPIC -fPIE -gdwarf-4 -Wall (Debian_Clang_19.1.7_(3+b1))
opt8_lowsizeclang -march=native -O -fwrapv -Qunused-arguments -fPIC -fPIE -gdwarf-4 -Wall (Debian_Clang_19.1.7_(3+b1))
opt8_lowsizeclang -march=native -Os -fwrapv -Qunused-arguments -fPIC -fPIE -gdwarf-4 -Wall (Debian_Clang_19.1.7_(3+b1))
opt8_lowsizeclang -mcpu=native -O3 -fwrapv -Qunused-arguments -fPIC -fPIE -gdwarf-4 -Wall (Debian_Clang_19.1.7_(3+b1))
opt8_lowsizegcc -march=native -mtune=native -O2 -fwrapv -fPIC -fPIE -gdwarf-4 -Wall (14.2.0)
opt8_lowsizegcc -march=native -mtune=native -O3 -fwrapv -fPIC -fPIE -gdwarf-4 -Wall (14.2.0)
opt8_lowsizegcc -march=native -mtune=native -O -fwrapv -fPIC -fPIE -gdwarf-4 -Wall (14.2.0)
opt8_lowsizegcc -march=native -mtune=native -Os -fwrapv -fPIC -fPIE -gdwarf-4 -Wall (14.2.0)
refclang -march=native -O2 -fwrapv -Qunused-arguments -fPIC -fPIE -gdwarf-4 -Wall (Debian_Clang_19.1.7_(3+b1))
refclang -march=native -O3 -fwrapv -Qunused-arguments -fPIC -fPIE -gdwarf-4 -Wall (Debian_Clang_19.1.7_(3+b1))
refclang -march=native -O -fwrapv -Qunused-arguments -fPIC -fPIE -gdwarf-4 -Wall (Debian_Clang_19.1.7_(3+b1))
refclang -march=native -Os -fwrapv -Qunused-arguments -fPIC -fPIE -gdwarf-4 -Wall (Debian_Clang_19.1.7_(3+b1))
refclang -mcpu=native -O3 -fwrapv -Qunused-arguments -fPIC -fPIE -gdwarf-4 -Wall (Debian_Clang_19.1.7_(3+b1))
refgcc -march=native -mtune=native -O2 -fwrapv -fPIC -fPIE -gdwarf-4 -Wall (14.2.0)
refgcc -march=native -mtune=native -O3 -fwrapv -fPIC -fPIE -gdwarf-4 -Wall (14.2.0)
refgcc -march=native -mtune=native -O -fwrapv -fPIC -fPIE -gdwarf-4 -Wall (14.2.0)
refgcc -march=native -mtune=native -Os -fwrapv -fPIC -fPIE -gdwarf-4 -Wall (14.2.0)