Test results for amd64, thinksky, crypto_aead/aes128gcmv1

[Page version: 20261028 01:16:00]

Measurements for amd64, thinksky, crypto_aead Test results for amd64, thinksky, crypto_aead Test results for crypto_aead/aes128gcmv1
Computer: thinksky
Microarchitecture: amd64; Skylake (506e3)
Architecture: amd64
CPU ID: GenuineIntel-000506e3-bfebfbff
SUPERCOP version: 20261018
Operation: crypto_aead
Primitive: aes128gcmv1
TimeObject sizeTest sizeImplementationCompilerBenchmark dateSUPERCOP version
557614506 0 048668 1272 1688T:dolbeau/aesenc-intclang -march=native -O3 -fwrapv -Qunused-arguments -fPIC -fPIE -gdwarf-4 -Wall2026101920261018
562114474 0 048684 1272 1688T:dolbeau/aesenc-intclang -march=native -O2 -fwrapv -Qunused-arguments -fPIC -fPIE -gdwarf-4 -Wall2026101920261018
564413430 0 044386 1264 1688T:dolbeau/aesenc-intclang -march=native -Os -fwrapv -Qunused-arguments -fPIC -fPIE -gdwarf-4 -Wall2026101920261018
594313463 0 043760 1272 1624T:dolbeau/aesenc-intclang -march=native -O -fwrapv -Qunused-arguments -fPIC -fPIE -gdwarf-4 -Wall2026101920261018
658615171 0 049159 1232 1720T:dolbeau/aesenc-intgcc -march=native -mtune=native -O3 -fwrapv -fPIC -fPIE -gdwarf-4 -Wall2026101920261018
729310171 0 041839 1232 1720T:dolbeau/aesenc-intgcc -march=native -mtune=native -O2 -fwrapv -fPIC -fPIE -gdwarf-4 -Wall2026101920261018
75536004 0 035218 1208 1688T:dolbeau/aesenc-intgcc -march=native -mtune=native -Os -fwrapv -fPIC -fPIE -gdwarf-4 -Wall2026101920261018
762010823 0 041966 1224 1720T:dolbeau/aesenc-intgcc -march=native -mtune=native -O -fwrapv -fPIC -fPIE -gdwarf-4 -Wall2026101920261018
8305902 0 035995 1352 1688T:opensslnewclang -march=native -O3 -fwrapv -Qunused-arguments -fPIC -fPIE -gdwarf-4 -Wall2026101920261018
8339857 0 030896 1304 1688T:opensslnewgcc -march=native -mtune=native -Os -fwrapv -fPIC -fPIE -gdwarf-4 -Wall2026101920261018
8416891 0 032841 1344 1688T:opensslnewclang -march=native -Os -fwrapv -Qunused-arguments -fPIC -fPIE -gdwarf-4 -Wall2026101920261018
8434973 0 032948 1320 1720T:opensslnewgcc -march=native -mtune=native -O -fwrapv -fPIC -fPIE -gdwarf-4 -Wall2026101920261018
8520902 0 035071 1352 1624T:opensslnewclang -mcpu=native -O3 -fwrapv -Qunused-arguments -fPIC -fPIE -gdwarf-4 -Wall2026101920261018
8574908 0 035773 1328 1720T:opensslnewgcc -march=native -mtune=native -O3 -fwrapv -fPIC -fPIE -gdwarf-4 -Wall2026101920261018
8730908 0 033365 1328 1720T:opensslnewgcc -march=native -mtune=native -O2 -fwrapv -fPIC -fPIE -gdwarf-4 -Wall2026101920261018
9219914 0 032207 1352 1624T:opensslnewclang -march=native -O -fwrapv -Qunused-arguments -fPIC -fPIE -gdwarf-4 -Wall2026101920261018
9637902 0 036075 1352 1688T:opensslnewclang -march=native -O2 -fwrapv -Qunused-arguments -fPIC -fPIE -gdwarf-4 -Wall2026101920261018
19770? ? ?391671 14536 1264rust_aes_gcmgcc -march=native -mtune=native -O3 -fwrapv -fPIC -fPIE -gdwarf-4 -Wall2026101920261018
19785? ? ?391840 14544 1192rust_aes_gcmclang -march=native -O3 -fwrapv -Qunused-arguments -fPIC -fPIE -gdwarf-4 -Wall2026101920261018
19932? ? ?391912 14544 1192rust_aes_gcmclang -march=native -O2 -fwrapv -Qunused-arguments -fPIC -fPIE -gdwarf-4 -Wall2026101920261018
19932? ? ?387187 14528 1264rust_aes_gcmgcc -march=native -mtune=native -Os -fwrapv -fPIC -fPIE -gdwarf-4 -Wall2026101920261018
19964? ? ?388064 14544 1160rust_aes_gcmclang -march=native -O -fwrapv -Qunused-arguments -fPIC -fPIE -gdwarf-4 -Wall2026101920261018
19967? ? ?390960 14544 1160rust_aes_gcmclang -mcpu=native -O3 -fwrapv -Qunused-arguments -fPIC -fPIE -gdwarf-4 -Wall2026101920261018
19981? ? ?388963 14536 1264rust_aes_gcmgcc -march=native -mtune=native -O -fwrapv -fPIC -fPIE -gdwarf-4 -Wall2026101920261018
19985? ? ?388818 14536 1192rust_aes_gcmclang -march=native -Os -fwrapv -Qunused-arguments -fPIC -fPIE -gdwarf-4 -Wall2026101920261018
20067? ? ?389247 14536 1264rust_aes_gcmgcc -march=native -mtune=native -O2 -fwrapv -fPIC -fPIE -gdwarf-4 -Wall2026101920261018
16557153752 0 1638556 1272 1720T:refclang -march=native -O3 -fwrapv -Qunused-arguments -fPIC -fPIE -gdwarf-4 -Wall2026101920261018
16860063732 0 1638540 1272 1720T:refclang -march=native -O2 -fwrapv -Qunused-arguments -fPIC -fPIE -gdwarf-4 -Wall2026101920261018
17596171853 0 1633450 1264 1720T:refclang -march=native -Os -fwrapv -Qunused-arguments -fPIC -fPIE -gdwarf-4 -Wall2026101920261018
17977483679 0 1638175 1232 1752T:refgcc -march=native -mtune=native -O3 -fwrapv -fPIC -fPIE -gdwarf-4 -Wall2026101920261018
18007353436 0 1637280 1272 1656T:refclang -mcpu=native -O3 -fwrapv -Qunused-arguments -fPIC -fPIE -gdwarf-4 -Wall2026101920261018
18606921969 0 1634095 1232 1752T:refgcc -march=native -mtune=native -O2 -fwrapv -fPIC -fPIE -gdwarf-4 -Wall2026101920261018
147421681780 0 1632720 1272 1656T:refclang -march=native -O -fwrapv -Qunused-arguments -fPIC -fPIE -gdwarf-4 -Wall2026101920261018
171447072075 0 1633742 1224 1752T:refgcc -march=native -mtune=native -O -fwrapv -fPIC -fPIE -gdwarf-4 -Wall2026101920261018
177506481714 0 1631418 1208 1720T:refgcc -march=native -mtune=native -Os -fwrapv -fPIC -fPIE -gdwarf-4 -Wall2026101920261018

Compiler output


aesenc-int.c: aesenc-int.c:41:25: warning: unused variable 'temp2' [-Wunused-variable]
aesenc-int.c:    41 |   __m128i temp0, temp1, temp2, temp4;
aesenc-int.c:       |                         ^~~~~
aesenc-int.c: aesenc-int.c:248:17: warning: unused variable 'rev' [-Wunused-variable]
aesenc-int.c:   248 |   const __m128i rev = _mm_set_epi8(0,1,2,3,4,5,6,7,8,9,10,11,12,13,14,15);
aesenc-int.c:       |                 ^~~
aesenc-int.c: aesenc-int.c:342:15: warning: unused variable 'tmplo' [-Wunused-variable]
aesenc-int.c:   342 |   __m128i lo, tmplo, hi, tmphi;
aesenc-int.c:       |               ^~~~~
aesenc-int.c: aesenc-int.c:342:26: warning: unused variable 'tmphi' [-Wunused-variable]
aesenc-int.c:   342 |   __m128i lo, tmplo, hi, tmphi;
aesenc-int.c:       |                          ^~~~~
aesenc-int.c: aesenc-int.c:446:15: warning: unused variable 'tmplo' [-Wunused-variable]
aesenc-int.c:   446 |   __m128i lo, tmplo, hi, tmphi;
aesenc-int.c:       |               ^~~~~
aesenc-int.c: aesenc-int.c:446:26: warning: unused variable 'tmphi' [-Wunused-variable]
aesenc-int.c:   446 |   __m128i lo, tmplo, hi, tmphi;
aesenc-int.c:       |                          ^~~~~
aesenc-int.c: aesenc-int.c:139:20: warning: unused function 'inc' [-Wunused-function]
aesenc-int.c:   139 | static inline void inc(unsigned char *n) {
aesenc-int.c:       |                    ^~~
aesenc-int.c: aesenc-int.c:162:1: warning: unused function 'aesni_encrypt2' [-Wunused-function]
aesenc-int.c:   162 | FUNC(2, MAKE2)
aesenc-int.c:       | ^~~~~~~~~~~~~~
aesenc-int.c: aesenc-int.c:149:22: note: expanded from macro 'FUNC'
aesenc-int.c: ...

Number of similar (implementation,compiler) pairs: 4, namely:
ImplementationCompiler
T:dolbeau/aesenc-intclang -march=native -O2 -fwrapv -Qunused-arguments -fPIC -fPIE -gdwarf-4 -Wall (Debian_Clang_19.1.7_(3+b1))
T:dolbeau/aesenc-intclang -march=native -O3 -fwrapv -Qunused-arguments -fPIC -fPIE -gdwarf-4 -Wall (Debian_Clang_19.1.7_(3+b1))
T:dolbeau/aesenc-intclang -march=native -O -fwrapv -Qunused-arguments -fPIC -fPIE -gdwarf-4 -Wall (Debian_Clang_19.1.7_(3+b1))
T:dolbeau/aesenc-intclang -march=native -Os -fwrapv -Qunused-arguments -fPIC -fPIE -gdwarf-4 -Wall (Debian_Clang_19.1.7_(3+b1))

Compiler output


aesenc-int.c: aesenc-int.c:41:25: warning: unused variable 'temp2' [-Wunused-variable]
aesenc-int.c:    41 |   __m128i temp0, temp1, temp2, temp4;
aesenc-int.c:       |                         ^~~~~
aesenc-int.c: aesenc-int.c:248:17: warning: unused variable 'rev' [-Wunused-variable]
aesenc-int.c:   248 |   const __m128i rev = _mm_set_epi8(0,1,2,3,4,5,6,7,8,9,10,11,12,13,14,15);
aesenc-int.c:       |                 ^~~
aesenc-int.c: aesenc-int.c:342:15: warning: unused variable 'tmplo' [-Wunused-variable]
aesenc-int.c:   342 |   __m128i lo, tmplo, hi, tmphi;
aesenc-int.c:       |               ^~~~~
aesenc-int.c: aesenc-int.c:342:26: warning: unused variable 'tmphi' [-Wunused-variable]
aesenc-int.c:   342 |   __m128i lo, tmplo, hi, tmphi;
aesenc-int.c:       |                          ^~~~~
aesenc-int.c: aesenc-int.c:446:15: warning: unused variable 'tmplo' [-Wunused-variable]
aesenc-int.c:   446 |   __m128i lo, tmplo, hi, tmphi;
aesenc-int.c:       |               ^~~~~
aesenc-int.c: aesenc-int.c:446:26: warning: unused variable 'tmphi' [-Wunused-variable]
aesenc-int.c:   446 |   __m128i lo, tmplo, hi, tmphi;
aesenc-int.c:       |                          ^~~~~
aesenc-int.c: aesenc-int.c:643:16: error: always_inline function '_mm_shuffle_epi8' requires target feature 'ssse3', but would be inlined into function 'crypto_aead_aes128gcmv1_dolbeau_aesenc_int_timingleaks_encrypt' that is compiled without support for 'ssse3'
aesenc-int.c:   643 |   __m128i Hv = _mm_shuffle_epi8(_mm_loadu_si128((const __m128i*)H), rev);
aesenc-int.c:       |                ^
aesenc-int.c: 6 warnings and 1 error generated.

Number of similar (implementation,compiler) pairs: 1, namely:
ImplementationCompiler
T:dolbeau/aesenc-intclang -mcpu=native -O3 -fwrapv -Qunused-arguments -fPIC -fPIE -gdwarf-4 -Wall (Debian_Clang_19.1.7_(3+b1))

Compiler output


aesenc-int.c: aesenc-int.c:24:9: warning: "_bswap64" redefined
aesenc-int.c:    24 | #define _bswap64(a) __builtin_bswap64(a)
aesenc-int.c:       |         ^~~~~~~~
aesenc-int.c: In file included from /usr/lib/gcc/x86_64-linux-gnu/14/include/x86gprintrin.h:33,
aesenc-int.c:                  from /usr/lib/gcc/x86_64-linux-gnu/14/include/immintrin.h:27,
aesenc-int.c:                  from aesenc-int.c:11:
aesenc-int.c: /usr/lib/gcc/x86_64-linux-gnu/14/include/ia32intrin.h:273:9: note: this is the location of the previous definition
aesenc-int.c:   273 | #define _bswap64(a)             __bswapq(a)
aesenc-int.c:       |         ^~~~~~~~
aesenc-int.c: aesenc-int.c:25:9: warning: "_bswap" redefined
aesenc-int.c:    25 | #define _bswap(a) __builtin_bswap32(a)
aesenc-int.c:       |         ^~~~~~
aesenc-int.c: /usr/lib/gcc/x86_64-linux-gnu/14/include/ia32intrin.h:307:9: note: this is the location of the previous definition
aesenc-int.c:   307 | #define _bswap(a)               __bswapd(a)
aesenc-int.c:       |         ^~~~~~
aesenc-int.c: aesenc-int.c: In function 'aesni_key128_expand':
aesenc-int.c: aesenc-int.c:41:25: warning: unused variable 'temp2' [-Wunused-variable]
aesenc-int.c:    41 |   __m128i temp0, temp1, temp2, temp4;
aesenc-int.c:       |                         ^~~~~
aesenc-int.c: aesenc-int.c: In function 'aesni_encrypt1':
aesenc-int.c: aesenc-int.c:76: warning: ignoring '#pragma unroll ' [-Wunknown-pragmas]
aesenc-int.c:    76 | #pragma unroll(9)
aesenc-int.c: aesenc-int.c: In function 'addmul':
aesenc-int.c: aesenc-int.c:195:64: warning: suggest parentheses around arithmetic in operand of '^' [-Wparentheses]
aesenc-int.c:   195 |     unsigned long long mask = -1ull ^ (1ull<<(((16-xlen)%8)*8))-1ull;
aesenc-int.c: ...

Number of similar (implementation,compiler) pairs: 4, namely:
ImplementationCompiler
T:dolbeau/aesenc-intgcc -march=native -mtune=native -O2 -fwrapv -fPIC -fPIE -gdwarf-4 -Wall (14.2.0)
T:dolbeau/aesenc-intgcc -march=native -mtune=native -O3 -fwrapv -fPIC -fPIE -gdwarf-4 -Wall (14.2.0)
T:dolbeau/aesenc-intgcc -march=native -mtune=native -O -fwrapv -fPIC -fPIE -gdwarf-4 -Wall (14.2.0)
T:dolbeau/aesenc-intgcc -march=native -mtune=native -Os -fwrapv -fPIC -fPIE -gdwarf-4 -Wall (14.2.0)

Compiler output


decrypt.c: decrypt.c:13:18: error: variable has incomplete type 'EVP_CIPHER_CTX' (aka 'struct evp_cipher_ctx_st')
decrypt.c:    13 |   EVP_CIPHER_CTX x;
decrypt.c:       |                  ^
decrypt.c: /usr/include/openssl/types.h:111:16: note: forward declaration of 'struct evp_cipher_ctx_st'
decrypt.c:   111 | typedef struct evp_cipher_ctx_st EVP_CIPHER_CTX;
decrypt.c:       |                ^
decrypt.c: 1 error generated.

Number of similar (implementation,compiler) pairs: 5, namely:
ImplementationCompiler
T:opensslclang -march=native -O2 -fwrapv -Qunused-arguments -fPIC -fPIE -gdwarf-4 -Wall (Debian_Clang_19.1.7_(3+b1))
T:opensslclang -march=native -O3 -fwrapv -Qunused-arguments -fPIC -fPIE -gdwarf-4 -Wall (Debian_Clang_19.1.7_(3+b1))
T:opensslclang -march=native -O -fwrapv -Qunused-arguments -fPIC -fPIE -gdwarf-4 -Wall (Debian_Clang_19.1.7_(3+b1))
T:opensslclang -march=native -Os -fwrapv -Qunused-arguments -fPIC -fPIE -gdwarf-4 -Wall (Debian_Clang_19.1.7_(3+b1))
T:opensslclang -mcpu=native -O3 -fwrapv -Qunused-arguments -fPIC -fPIE -gdwarf-4 -Wall (Debian_Clang_19.1.7_(3+b1))

Compiler output


decrypt.c: decrypt.c: In function 'crypto_aead_aes128gcmv1_openssl_timingleaks_decrypt':
decrypt.c: decrypt.c:13:18: error: storage size of 'x' isn't known
decrypt.c:    13 |   EVP_CIPHER_CTX x;
decrypt.c:       |                  ^
decrypt.c: decrypt.c:13:18: warning: unused variable 'x' [-Wunused-variable]

Number of similar (implementation,compiler) pairs: 4, namely:
ImplementationCompiler
T:opensslgcc -march=native -mtune=native -O2 -fwrapv -fPIC -fPIE -gdwarf-4 -Wall (14.2.0)
T:opensslgcc -march=native -mtune=native -O3 -fwrapv -fPIC -fPIE -gdwarf-4 -Wall (14.2.0)
T:opensslgcc -march=native -mtune=native -O -fwrapv -fPIC -fPIE -gdwarf-4 -Wall (14.2.0)
T:opensslgcc -march=native -mtune=native -Os -fwrapv -fPIC -fPIE -gdwarf-4 -Wall (14.2.0)

Compiler output


try.c: error[E0310]: the parameter type `T` may not live long enough
try.c:     --> /home/supercop/.cargo/registry/src/index.crates.io-1949cf8c6b5b557f/rustc-serialize-0.3.24/src/serialize.rs:1155:5
try.c:      |
try.c: 1155 |     fn decode<D: Decoder>(d: &mut D) -> Result<Cow<'static, T>, D::Error> {
try.c:      |     ^^^^^^^^^^^^^^^^^^^^^^^^^^^^^^^^^^^^^^^^^^^^^^^^^^^^^^^^^^^^^^^^^^^^^
try.c:      |     |
try.c:      |     the parameter type `T` must be valid for the static lifetime...
try.c:      |     ...so that the type `T` will meet its required lifetime bounds...
try.c:      |
try.c: note: ...that is required by this bound
try.c:     --> /usr/src/rustc-1.85.1/library/alloc/src/borrow.rs:179:30
try.c: help: consider adding an explicit lifetime bound
try.c:      |
try.c: 1151 | impl<'a, T: ?Sized + 'static> Decodable for Cow<'a, T>
try.c:      |                    +++++++++
try.c:
try.c: For more information about this error, try `rustc --explain E0310`.
try.c: error: could not compile `rustc-serialize` (lib) due to 1 previous error

Number of similar (implementation,compiler) pairs: 9, namely:
ImplementationCompiler
T:rust_cryptoclang -march=native -O2 -fwrapv -Qunused-arguments -fPIC -fPIE -gdwarf-4 -Wall (Debian_Clang_19.1.7_(3+b1))
T:rust_cryptoclang -march=native -O3 -fwrapv -Qunused-arguments -fPIC -fPIE -gdwarf-4 -Wall (Debian_Clang_19.1.7_(3+b1))
T:rust_cryptoclang -march=native -O -fwrapv -Qunused-arguments -fPIC -fPIE -gdwarf-4 -Wall (Debian_Clang_19.1.7_(3+b1))
T:rust_cryptoclang -march=native -Os -fwrapv -Qunused-arguments -fPIC -fPIE -gdwarf-4 -Wall (Debian_Clang_19.1.7_(3+b1))
T:rust_cryptoclang -mcpu=native -O3 -fwrapv -Qunused-arguments -fPIC -fPIE -gdwarf-4 -Wall (Debian_Clang_19.1.7_(3+b1))
T:rust_cryptogcc -march=native -mtune=native -O2 -fwrapv -fPIC -fPIE -gdwarf-4 -Wall (14.2.0)
T:rust_cryptogcc -march=native -mtune=native -O3 -fwrapv -fPIC -fPIE -gdwarf-4 -Wall (14.2.0)
T:rust_cryptogcc -march=native -mtune=native -O -fwrapv -fPIC -fPIE -gdwarf-4 -Wall (14.2.0)
T:rust_cryptogcc -march=native -mtune=native -Os -fwrapv -fPIC -fPIE -gdwarf-4 -Wall (14.2.0)

TIMECOP error (can be valgrind bug)


error 127
valgrind: ./try-timecop: No such file or directory

Number of similar (implementation,compiler) pairs: 9, namely:
ImplementationCompiler
rust_aes_gcmclang -march=native -O2 -fwrapv -Qunused-arguments -fPIC -fPIE -gdwarf-4 -Wall (Debian_Clang_19.1.7_(3+b1))
rust_aes_gcmclang -march=native -O3 -fwrapv -Qunused-arguments -fPIC -fPIE -gdwarf-4 -Wall (Debian_Clang_19.1.7_(3+b1))
rust_aes_gcmclang -march=native -O -fwrapv -Qunused-arguments -fPIC -fPIE -gdwarf-4 -Wall (Debian_Clang_19.1.7_(3+b1))
rust_aes_gcmclang -march=native -Os -fwrapv -Qunused-arguments -fPIC -fPIE -gdwarf-4 -Wall (Debian_Clang_19.1.7_(3+b1))
rust_aes_gcmclang -mcpu=native -O3 -fwrapv -Qunused-arguments -fPIC -fPIE -gdwarf-4 -Wall (Debian_Clang_19.1.7_(3+b1))
rust_aes_gcmgcc -march=native -mtune=native -O2 -fwrapv -fPIC -fPIE -gdwarf-4 -Wall (14.2.0)
rust_aes_gcmgcc -march=native -mtune=native -O3 -fwrapv -fPIC -fPIE -gdwarf-4 -Wall (14.2.0)
rust_aes_gcmgcc -march=native -mtune=native -O -fwrapv -fPIC -fPIE -gdwarf-4 -Wall (14.2.0)
rust_aes_gcmgcc -march=native -mtune=native -Os -fwrapv -fPIC -fPIE -gdwarf-4 -Wall (14.2.0)