Test results for amd64, hertz, crypto_aead/omdsha512k128n128tau128v1

[Page version: 20261007 20:07:58]

Measurements for amd64, hertz, crypto_aead Test results for amd64, hertz, crypto_aead Test results for crypto_aead/omdsha512k128n128tau128v1
Computer: hertz
Microarchitecture: amd64; Zen 4 (a60f12)
Architecture: amd64
CPU ID: AuthenticAMD-00a60f12-178bfbff
SUPERCOP version: 20261004
Operation: crypto_aead
Primitive: omdsha512k128n128tau128v1
TimeObject sizeTest sizeImplementationCompilerBenchmark dateSUPERCOP version
9267011838 0 049301 1264 1792T:refgcc -march=native -mtune=native -O3 -fwrapv -fPIC -fPIE -gdwarf-4 -Wall2026100620261004
9540719745 0 057755 1288 1696T:refclang -march=native -O2 -fwrapv -Qunused-arguments -fPIC -fPIE -gdwarf-4 -Wall2026100620261004
10776323506 0 062947 1288 1696T:refclang -march=native -O3 -fwrapv -Qunused-arguments -fPIC -fPIE -gdwarf-4 -Wall2026100620261004
1094255432 0 037837 1280 1696T:refclang -march=native -Os -fwrapv -Qunused-arguments -fPIC -fPIE -gdwarf-4 -Wall2026100620261004
1094596473 0 040341 1264 1792T:refgcc -march=native -mtune=native -O2 -fwrapv -fPIC -fPIE -gdwarf-4 -Wall2026100620261004
1110826367 0 037851 1288 1632T:refclang -march=native -O -fwrapv -Qunused-arguments -fPIC -fPIE -gdwarf-4 -Wall2026100620261004
1334116308 0 039564 1256 1728T:refgcc -march=native -mtune=native -O -fwrapv -fPIC -fPIE -gdwarf-4 -Wall2026100620261004
2030895132 0 036472 1240 1696T:refgcc -march=native -mtune=native -Os -fwrapv -fPIC -fPIE -gdwarf-4 -Wall2026100620261004

Compiler output


try.c: /usr/bin/x86_64-linux-gnu-ld.bfd: libcrypto_aead_omdsha512k128n128tau128v1.a(omdsha512.o):.../supercop-data/hertz/amd64/try/c/clang_-march=native_-O2_-fwrapv_-Qunused-arguments_-fPIC_-fPIE_-gdwarf-4_-Wall/timingleaks/crypto_aead/omdsha512k128n128tau128v1/avx1/work/./omdsha512.h:146: multiple definition of `Hash'; libcrypto_aead_omdsha512k128n128tau128v1.a(encrypt.o):.../supercop-data/hertz/amd64/try/c/clang_-march=native_-O2_-fwrapv_-Qunused-arguments_-fPIC_-fPIE_-gdwarf-4_-Wall/timingleaks/crypto_aead/omdsha512k128n128tau128v1/avx1/work/./omdsha512.h:146: first defined here
try.c: clang: error: linker command failed with exit code 1 (use -v to see invocation)

Number of similar (implementation,compiler) pairs: 1, namely:
ImplementationCompiler
T:avx1clang -march=native -O2 -fwrapv -Qunused-arguments -fPIC -fPIE -gdwarf-4 -Wall (Ubuntu_Clang_21.1.8_(6ubuntu1))

Compiler output


try.c: /usr/bin/x86_64-linux-gnu-ld.bfd: libcrypto_aead_omdsha512k128n128tau128v1.a(omdsha512.o):.../supercop-data/hertz/amd64/try/c/clang_-march=native_-O3_-fwrapv_-Qunused-arguments_-fPIC_-fPIE_-gdwarf-4_-Wall/timingleaks/crypto_aead/omdsha512k128n128tau128v1/avx1/work/./omdsha512.h:146: multiple definition of `Hash'; libcrypto_aead_omdsha512k128n128tau128v1.a(encrypt.o):.../supercop-data/hertz/amd64/try/c/clang_-march=native_-O3_-fwrapv_-Qunused-arguments_-fPIC_-fPIE_-gdwarf-4_-Wall/timingleaks/crypto_aead/omdsha512k128n128tau128v1/avx1/work/./omdsha512.h:146: first defined here
try.c: clang: error: linker command failed with exit code 1 (use -v to see invocation)

Number of similar (implementation,compiler) pairs: 1, namely:
ImplementationCompiler
T:avx1clang -march=native -O3 -fwrapv -Qunused-arguments -fPIC -fPIE -gdwarf-4 -Wall (Ubuntu_Clang_21.1.8_(6ubuntu1))

Compiler output


try.c: /usr/bin/x86_64-linux-gnu-ld.bfd: libcrypto_aead_omdsha512k128n128tau128v1.a(omdsha512.o):.../supercop-data/hertz/amd64/try/c/clang_-march=native_-O_-fwrapv_-Qunused-arguments_-fPIC_-fPIE_-gdwarf-4_-Wall/timingleaks/crypto_aead/omdsha512k128n128tau128v1/avx1/work/./omdsha512.h:146: multiple definition of `Hash'; libcrypto_aead_omdsha512k128n128tau128v1.a(encrypt.o):.../supercop-data/hertz/amd64/try/c/clang_-march=native_-O_-fwrapv_-Qunused-arguments_-fPIC_-fPIE_-gdwarf-4_-Wall/timingleaks/crypto_aead/omdsha512k128n128tau128v1/avx1/work/./omdsha512.h:146: first defined here
try.c: clang: error: linker command failed with exit code 1 (use -v to see invocation)

Number of similar (implementation,compiler) pairs: 1, namely:
ImplementationCompiler
T:avx1clang -march=native -O -fwrapv -Qunused-arguments -fPIC -fPIE -gdwarf-4 -Wall (Ubuntu_Clang_21.1.8_(6ubuntu1))

Compiler output


try.c: /usr/bin/x86_64-linux-gnu-ld.bfd: libcrypto_aead_omdsha512k128n128tau128v1.a(omdsha512.o):.../supercop-data/hertz/amd64/try/c/clang_-march=native_-Os_-fwrapv_-Qunused-arguments_-fPIC_-fPIE_-gdwarf-4_-Wall/timingleaks/crypto_aead/omdsha512k128n128tau128v1/avx1/work/./omdsha512.h:146: multiple definition of `Hash'; libcrypto_aead_omdsha512k128n128tau128v1.a(encrypt.o):.../supercop-data/hertz/amd64/try/c/clang_-march=native_-Os_-fwrapv_-Qunused-arguments_-fPIC_-fPIE_-gdwarf-4_-Wall/timingleaks/crypto_aead/omdsha512k128n128tau128v1/avx1/work/./omdsha512.h:146: first defined here
try.c: clang: error: linker command failed with exit code 1 (use -v to see invocation)

Number of similar (implementation,compiler) pairs: 1, namely:
ImplementationCompiler
T:avx1clang -march=native -Os -fwrapv -Qunused-arguments -fPIC -fPIE -gdwarf-4 -Wall (Ubuntu_Clang_21.1.8_(6ubuntu1))

Compiler output


encrypt.c: /tmp/cckgiYmR.s: Assembler messages:
encrypt.c: /tmp/cckgiYmR.s:3548: Warning: dwarf line number information for .data ignored
encrypt.c: /tmp/cckgiYmR.s:3550: Warning: dwarf line number information for .data ignored
encrypt.c: /tmp/cckgiYmR.s:3552: Warning: dwarf line number information for .data ignored
encrypt.c: /tmp/cckgiYmR.s:3553: Warning: dwarf line number information for .data ignored
encrypt.c: /tmp/cckgiYmR.s:3554: Warning: dwarf line number information for .data ignored
encrypt.c: /tmp/cckgiYmR.s:3556: Warning: dwarf line number information for .data ignored
encrypt.c: /tmp/cckgiYmR.s:3558: Warning: dwarf line number information for .data ignored
encrypt.c: /tmp/cckgiYmR.s:3560: Warning: dwarf line number information for .data ignored
encrypt.c: /tmp/cckgiYmR.s:3561: Warning: dwarf line number information for .data ignored
encrypt.c: /tmp/cckgiYmR.s:3564: Warning: dwarf line number information for .data ignored
encrypt.c: /tmp/cckgiYmR.s:3567: Warning: dwarf line number information for .data ignored
encrypt.c: /tmp/cckgiYmR.s:3570: Warning: dwarf line number information for .data ignored
encrypt.c: /tmp/cckgiYmR.s:3573: Warning: dwarf line number information for .data ignored
encrypt.c: /tmp/cckgiYmR.s:3583: Warning: dwarf line number information for .data ignored
encrypt.c: /tmp/cckgiYmR.s:3585: Warning: dwarf line number information for .data ignored
encrypt.c: /tmp/cckgiYmR.s:3587: Warning: dwarf line number information for .data ignored
encrypt.c: /tmp/cckgiYmR.s:3588: Warning: dwarf line number information for .data ignored
encrypt.c: /tmp/cckgiYmR.s:3589: Warning: dwarf line number information for .data ignored
encrypt.c: /tmp/cckgiYmR.s:3592: Warning: dwarf line number information for .data ignored
encrypt.c: /tmp/cckgiYmR.s:3595: Warning: dwarf line number information for .data ignored
encrypt.c: /tmp/cckgiYmR.s:3599: Warning: dwarf line number information for .data ignored
encrypt.c: /tmp/cckgiYmR.s:3601: Warning: dwarf line number information for .data ignored
encrypt.c: /tmp/cckgiYmR.s:3604: Warning: dwarf line number information for .data ignored
encrypt.c: /tmp/cckgiYmR.s:3606: Warning: dwarf line number information for .data ignored
encrypt.c: ...

Number of similar (implementation,compiler) pairs: 1, namely:
ImplementationCompiler
T:avx1gcc -march=native -mtune=native -O2 -fwrapv -fPIC -fPIE -gdwarf-4 -Wall (15.2.0)

Compiler output


encrypt.c: /tmp/cc7vctgC.s: Assembler messages:
encrypt.c: /tmp/cc7vctgC.s:3548: Warning: dwarf line number information for .data ignored
encrypt.c: /tmp/cc7vctgC.s:3550: Warning: dwarf line number information for .data ignored
encrypt.c: /tmp/cc7vctgC.s:3552: Warning: dwarf line number information for .data ignored
encrypt.c: /tmp/cc7vctgC.s:3553: Warning: dwarf line number information for .data ignored
encrypt.c: /tmp/cc7vctgC.s:3554: Warning: dwarf line number information for .data ignored
encrypt.c: /tmp/cc7vctgC.s:3556: Warning: dwarf line number information for .data ignored
encrypt.c: /tmp/cc7vctgC.s:3558: Warning: dwarf line number information for .data ignored
encrypt.c: /tmp/cc7vctgC.s:3560: Warning: dwarf line number information for .data ignored
encrypt.c: /tmp/cc7vctgC.s:3561: Warning: dwarf line number information for .data ignored
encrypt.c: /tmp/cc7vctgC.s:3564: Warning: dwarf line number information for .data ignored
encrypt.c: /tmp/cc7vctgC.s:3567: Warning: dwarf line number information for .data ignored
encrypt.c: /tmp/cc7vctgC.s:3570: Warning: dwarf line number information for .data ignored
encrypt.c: /tmp/cc7vctgC.s:3573: Warning: dwarf line number information for .data ignored
encrypt.c: /tmp/cc7vctgC.s:3583: Warning: dwarf line number information for .data ignored
encrypt.c: /tmp/cc7vctgC.s:3585: Warning: dwarf line number information for .data ignored
encrypt.c: /tmp/cc7vctgC.s:3587: Warning: dwarf line number information for .data ignored
encrypt.c: /tmp/cc7vctgC.s:3588: Warning: dwarf line number information for .data ignored
encrypt.c: /tmp/cc7vctgC.s:3589: Warning: dwarf line number information for .data ignored
encrypt.c: /tmp/cc7vctgC.s:3592: Warning: dwarf line number information for .data ignored
encrypt.c: /tmp/cc7vctgC.s:3595: Warning: dwarf line number information for .data ignored
encrypt.c: /tmp/cc7vctgC.s:3599: Warning: dwarf line number information for .data ignored
encrypt.c: /tmp/cc7vctgC.s:3601: Warning: dwarf line number information for .data ignored
encrypt.c: /tmp/cc7vctgC.s:3604: Warning: dwarf line number information for .data ignored
encrypt.c: /tmp/cc7vctgC.s:3606: Warning: dwarf line number information for .data ignored
encrypt.c: ...

Number of similar (implementation,compiler) pairs: 1, namely:
ImplementationCompiler
T:avx1gcc -march=native -mtune=native -O3 -fwrapv -fPIC -fPIE -gdwarf-4 -Wall (15.2.0)

Compiler output


encrypt.c: /tmp/ccCkT6SU.s: Assembler messages:
encrypt.c: /tmp/ccCkT6SU.s:3547: Warning: dwarf line number information for .data ignored
encrypt.c: /tmp/ccCkT6SU.s:3549: Warning: dwarf line number information for .data ignored
encrypt.c: /tmp/ccCkT6SU.s:3553: Warning: dwarf line number information for .data ignored
encrypt.c: /tmp/ccCkT6SU.s:3554: Warning: dwarf line number information for .data ignored
encrypt.c: /tmp/ccCkT6SU.s:3555: Warning: dwarf line number information for .data ignored
encrypt.c: /tmp/ccCkT6SU.s:3558: Warning: dwarf line number information for .data ignored
encrypt.c: /tmp/ccCkT6SU.s:3559: Warning: dwarf line number information for .data ignored
encrypt.c: /tmp/ccCkT6SU.s:3566: Warning: dwarf line number information for .data ignored
encrypt.c: /tmp/ccCkT6SU.s:3569: Warning: dwarf line number information for .data ignored
encrypt.c: /tmp/ccCkT6SU.s:3581: Warning: dwarf line number information for .data ignored
encrypt.c: /tmp/ccCkT6SU.s:3583: Warning: dwarf line number information for .data ignored
encrypt.c: /tmp/ccCkT6SU.s:3589: Warning: dwarf line number information for .data ignored
encrypt.c: /tmp/ccCkT6SU.s:3592: Warning: dwarf line number information for .data ignored
encrypt.c: /tmp/ccCkT6SU.s:3595: Warning: dwarf line number information for .data ignored
encrypt.c: /tmp/ccCkT6SU.s:3596: Warning: dwarf line number information for .data ignored
encrypt.c: /tmp/ccCkT6SU.s:3597: Warning: dwarf line number information for .data ignored
encrypt.c: /tmp/ccCkT6SU.s:3600: Warning: dwarf line number information for .data ignored
encrypt.c: /tmp/ccCkT6SU.s:3601: Warning: dwarf line number information for .data ignored
encrypt.c: /tmp/ccCkT6SU.s:3608: Warning: dwarf line number information for .data ignored
encrypt.c: /tmp/ccCkT6SU.s:3611: Warning: dwarf line number information for .data ignored
encrypt.c: /tmp/ccCkT6SU.s:3614: Warning: dwarf line number information for .data ignored
encrypt.c: /tmp/ccCkT6SU.s:10119: Error: leb128 operand is an undefined symbol: .LVU20
encrypt.c: /tmp/ccCkT6SU.s:10120: Error: leb128 operand is an undefined symbol: .LVU20
encrypt.c: /tmp/ccCkT6SU.s:10138: Error: leb128 operand is an undefined symbol: .LVU19
encrypt.c: ...

Number of similar (implementation,compiler) pairs: 1, namely:
ImplementationCompiler
T:avx1gcc -march=native -mtune=native -O -fwrapv -fPIC -fPIE -gdwarf-4 -Wall (15.2.0)

Compiler output


encrypt.c: /tmp/ccHyqica.s: Assembler messages:
encrypt.c: /tmp/ccHyqica.s:3547: Warning: dwarf line number information for .data ignored
encrypt.c: /tmp/ccHyqica.s:3549: Warning: dwarf line number information for .data ignored
encrypt.c: /tmp/ccHyqica.s:3551: Warning: dwarf line number information for .data ignored
encrypt.c: /tmp/ccHyqica.s:3552: Warning: dwarf line number information for .data ignored
encrypt.c: /tmp/ccHyqica.s:3553: Warning: dwarf line number information for .data ignored
encrypt.c: /tmp/ccHyqica.s:3555: Warning: dwarf line number information for .data ignored
encrypt.c: /tmp/ccHyqica.s:3557: Warning: dwarf line number information for .data ignored
encrypt.c: /tmp/ccHyqica.s:3559: Warning: dwarf line number information for .data ignored
encrypt.c: /tmp/ccHyqica.s:3560: Warning: dwarf line number information for .data ignored
encrypt.c: /tmp/ccHyqica.s:3563: Warning: dwarf line number information for .data ignored
encrypt.c: /tmp/ccHyqica.s:3566: Warning: dwarf line number information for .data ignored
encrypt.c: /tmp/ccHyqica.s:3570: Warning: dwarf line number information for .data ignored
encrypt.c: /tmp/ccHyqica.s:3573: Warning: dwarf line number information for .data ignored
encrypt.c: /tmp/ccHyqica.s:3582: Warning: dwarf line number information for .data ignored
encrypt.c: /tmp/ccHyqica.s:3584: Warning: dwarf line number information for .data ignored
encrypt.c: /tmp/ccHyqica.s:3586: Warning: dwarf line number information for .data ignored
encrypt.c: /tmp/ccHyqica.s:3587: Warning: dwarf line number information for .data ignored
encrypt.c: /tmp/ccHyqica.s:3588: Warning: dwarf line number information for .data ignored
encrypt.c: /tmp/ccHyqica.s:3591: Warning: dwarf line number information for .data ignored
encrypt.c: /tmp/ccHyqica.s:3594: Warning: dwarf line number information for .data ignored
encrypt.c: /tmp/ccHyqica.s:3598: Warning: dwarf line number information for .data ignored
encrypt.c: /tmp/ccHyqica.s:3600: Warning: dwarf line number information for .data ignored
encrypt.c: /tmp/ccHyqica.s:3603: Warning: dwarf line number information for .data ignored
encrypt.c: /tmp/ccHyqica.s:3605: Warning: dwarf line number information for .data ignored
encrypt.c: ...

Number of similar (implementation,compiler) pairs: 1, namely:
ImplementationCompiler
T:avx1gcc -march=native -mtune=native -Os -fwrapv -fPIC -fPIE -gdwarf-4 -Wall (15.2.0)

Compiler output


try.c: /usr/bin/x86_64-linux-gnu-ld.bfd: libcrypto_aead_omdsha512k128n128tau128v1.a(omdsha512.o):.../supercop-data/hertz/amd64/try/c/clang_-march=native_-O2_-fwrapv_-Qunused-arguments_-fPIC_-fPIE_-gdwarf-4_-Wall/timingleaks/crypto_aead/omdsha512k128n128tau128v1/sse4/work/./omdsha512.h:146: multiple definition of `Hash'; libcrypto_aead_omdsha512k128n128tau128v1.a(encrypt.o):.../supercop-data/hertz/amd64/try/c/clang_-march=native_-O2_-fwrapv_-Qunused-arguments_-fPIC_-fPIE_-gdwarf-4_-Wall/timingleaks/crypto_aead/omdsha512k128n128tau128v1/sse4/work/./omdsha512.h:146: first defined here
try.c: clang: error: linker command failed with exit code 1 (use -v to see invocation)

Number of similar (implementation,compiler) pairs: 1, namely:
ImplementationCompiler
T:sse4clang -march=native -O2 -fwrapv -Qunused-arguments -fPIC -fPIE -gdwarf-4 -Wall (Ubuntu_Clang_21.1.8_(6ubuntu1))

Compiler output


try.c: /usr/bin/x86_64-linux-gnu-ld.bfd: libcrypto_aead_omdsha512k128n128tau128v1.a(omdsha512.o):.../supercop-data/hertz/amd64/try/c/clang_-march=native_-O3_-fwrapv_-Qunused-arguments_-fPIC_-fPIE_-gdwarf-4_-Wall/timingleaks/crypto_aead/omdsha512k128n128tau128v1/sse4/work/./omdsha512.h:146: multiple definition of `Hash'; libcrypto_aead_omdsha512k128n128tau128v1.a(encrypt.o):.../supercop-data/hertz/amd64/try/c/clang_-march=native_-O3_-fwrapv_-Qunused-arguments_-fPIC_-fPIE_-gdwarf-4_-Wall/timingleaks/crypto_aead/omdsha512k128n128tau128v1/sse4/work/./omdsha512.h:146: first defined here
try.c: clang: error: linker command failed with exit code 1 (use -v to see invocation)

Number of similar (implementation,compiler) pairs: 1, namely:
ImplementationCompiler
T:sse4clang -march=native -O3 -fwrapv -Qunused-arguments -fPIC -fPIE -gdwarf-4 -Wall (Ubuntu_Clang_21.1.8_(6ubuntu1))

Compiler output


try.c: /usr/bin/x86_64-linux-gnu-ld.bfd: libcrypto_aead_omdsha512k128n128tau128v1.a(omdsha512.o):.../supercop-data/hertz/amd64/try/c/clang_-march=native_-O_-fwrapv_-Qunused-arguments_-fPIC_-fPIE_-gdwarf-4_-Wall/timingleaks/crypto_aead/omdsha512k128n128tau128v1/sse4/work/./omdsha512.h:146: multiple definition of `Hash'; libcrypto_aead_omdsha512k128n128tau128v1.a(encrypt.o):.../supercop-data/hertz/amd64/try/c/clang_-march=native_-O_-fwrapv_-Qunused-arguments_-fPIC_-fPIE_-gdwarf-4_-Wall/timingleaks/crypto_aead/omdsha512k128n128tau128v1/sse4/work/./omdsha512.h:146: first defined here
try.c: clang: error: linker command failed with exit code 1 (use -v to see invocation)

Number of similar (implementation,compiler) pairs: 1, namely:
ImplementationCompiler
T:sse4clang -march=native -O -fwrapv -Qunused-arguments -fPIC -fPIE -gdwarf-4 -Wall (Ubuntu_Clang_21.1.8_(6ubuntu1))

Compiler output


try.c: /usr/bin/x86_64-linux-gnu-ld.bfd: libcrypto_aead_omdsha512k128n128tau128v1.a(omdsha512.o):.../supercop-data/hertz/amd64/try/c/clang_-march=native_-Os_-fwrapv_-Qunused-arguments_-fPIC_-fPIE_-gdwarf-4_-Wall/timingleaks/crypto_aead/omdsha512k128n128tau128v1/sse4/work/./omdsha512.h:146: multiple definition of `Hash'; libcrypto_aead_omdsha512k128n128tau128v1.a(encrypt.o):.../supercop-data/hertz/amd64/try/c/clang_-march=native_-Os_-fwrapv_-Qunused-arguments_-fPIC_-fPIE_-gdwarf-4_-Wall/timingleaks/crypto_aead/omdsha512k128n128tau128v1/sse4/work/./omdsha512.h:146: first defined here
try.c: clang: error: linker command failed with exit code 1 (use -v to see invocation)

Number of similar (implementation,compiler) pairs: 1, namely:
ImplementationCompiler
T:sse4clang -march=native -Os -fwrapv -Qunused-arguments -fPIC -fPIE -gdwarf-4 -Wall (Ubuntu_Clang_21.1.8_(6ubuntu1))

Compiler output


encrypt.c: /tmp/ccT6GYz1.s: Assembler messages:
encrypt.c: /tmp/ccT6GYz1.s:3376: Warning: dwarf line number information for .data ignored
encrypt.c: /tmp/ccT6GYz1.s:3378: Warning: dwarf line number information for .data ignored
encrypt.c: /tmp/ccT6GYz1.s:3380: Warning: dwarf line number information for .data ignored
encrypt.c: /tmp/ccT6GYz1.s:3381: Warning: dwarf line number information for .data ignored
encrypt.c: /tmp/ccT6GYz1.s:3382: Warning: dwarf line number information for .data ignored
encrypt.c: /tmp/ccT6GYz1.s:3384: Warning: dwarf line number information for .data ignored
encrypt.c: /tmp/ccT6GYz1.s:3386: Warning: dwarf line number information for .data ignored
encrypt.c: /tmp/ccT6GYz1.s:3388: Warning: dwarf line number information for .data ignored
encrypt.c: /tmp/ccT6GYz1.s:3389: Warning: dwarf line number information for .data ignored
encrypt.c: /tmp/ccT6GYz1.s:3392: Warning: dwarf line number information for .data ignored
encrypt.c: /tmp/ccT6GYz1.s:3395: Warning: dwarf line number information for .data ignored
encrypt.c: /tmp/ccT6GYz1.s:3398: Warning: dwarf line number information for .data ignored
encrypt.c: /tmp/ccT6GYz1.s:3401: Warning: dwarf line number information for .data ignored
encrypt.c: /tmp/ccT6GYz1.s:3411: Warning: dwarf line number information for .data ignored
encrypt.c: /tmp/ccT6GYz1.s:3413: Warning: dwarf line number information for .data ignored
encrypt.c: /tmp/ccT6GYz1.s:3415: Warning: dwarf line number information for .data ignored
encrypt.c: /tmp/ccT6GYz1.s:3416: Warning: dwarf line number information for .data ignored
encrypt.c: /tmp/ccT6GYz1.s:3417: Warning: dwarf line number information for .data ignored
encrypt.c: /tmp/ccT6GYz1.s:3420: Warning: dwarf line number information for .data ignored
encrypt.c: /tmp/ccT6GYz1.s:3423: Warning: dwarf line number information for .data ignored
encrypt.c: /tmp/ccT6GYz1.s:3427: Warning: dwarf line number information for .data ignored
encrypt.c: /tmp/ccT6GYz1.s:3429: Warning: dwarf line number information for .data ignored
encrypt.c: /tmp/ccT6GYz1.s:3432: Warning: dwarf line number information for .data ignored
encrypt.c: /tmp/ccT6GYz1.s:3434: Warning: dwarf line number information for .data ignored
encrypt.c: ...

Number of similar (implementation,compiler) pairs: 1, namely:
ImplementationCompiler
T:sse4gcc -march=native -mtune=native -O2 -fwrapv -fPIC -fPIE -gdwarf-4 -Wall (15.2.0)

Compiler output


encrypt.c: /tmp/ccG0N5zG.s: Assembler messages:
encrypt.c: /tmp/ccG0N5zG.s:3376: Warning: dwarf line number information for .data ignored
encrypt.c: /tmp/ccG0N5zG.s:3378: Warning: dwarf line number information for .data ignored
encrypt.c: /tmp/ccG0N5zG.s:3380: Warning: dwarf line number information for .data ignored
encrypt.c: /tmp/ccG0N5zG.s:3381: Warning: dwarf line number information for .data ignored
encrypt.c: /tmp/ccG0N5zG.s:3382: Warning: dwarf line number information for .data ignored
encrypt.c: /tmp/ccG0N5zG.s:3384: Warning: dwarf line number information for .data ignored
encrypt.c: /tmp/ccG0N5zG.s:3386: Warning: dwarf line number information for .data ignored
encrypt.c: /tmp/ccG0N5zG.s:3388: Warning: dwarf line number information for .data ignored
encrypt.c: /tmp/ccG0N5zG.s:3389: Warning: dwarf line number information for .data ignored
encrypt.c: /tmp/ccG0N5zG.s:3392: Warning: dwarf line number information for .data ignored
encrypt.c: /tmp/ccG0N5zG.s:3395: Warning: dwarf line number information for .data ignored
encrypt.c: /tmp/ccG0N5zG.s:3398: Warning: dwarf line number information for .data ignored
encrypt.c: /tmp/ccG0N5zG.s:3401: Warning: dwarf line number information for .data ignored
encrypt.c: /tmp/ccG0N5zG.s:3411: Warning: dwarf line number information for .data ignored
encrypt.c: /tmp/ccG0N5zG.s:3413: Warning: dwarf line number information for .data ignored
encrypt.c: /tmp/ccG0N5zG.s:3415: Warning: dwarf line number information for .data ignored
encrypt.c: /tmp/ccG0N5zG.s:3416: Warning: dwarf line number information for .data ignored
encrypt.c: /tmp/ccG0N5zG.s:3417: Warning: dwarf line number information for .data ignored
encrypt.c: /tmp/ccG0N5zG.s:3420: Warning: dwarf line number information for .data ignored
encrypt.c: /tmp/ccG0N5zG.s:3423: Warning: dwarf line number information for .data ignored
encrypt.c: /tmp/ccG0N5zG.s:3427: Warning: dwarf line number information for .data ignored
encrypt.c: /tmp/ccG0N5zG.s:3429: Warning: dwarf line number information for .data ignored
encrypt.c: /tmp/ccG0N5zG.s:3432: Warning: dwarf line number information for .data ignored
encrypt.c: /tmp/ccG0N5zG.s:3434: Warning: dwarf line number information for .data ignored
encrypt.c: ...

Number of similar (implementation,compiler) pairs: 1, namely:
ImplementationCompiler
T:sse4gcc -march=native -mtune=native -O3 -fwrapv -fPIC -fPIE -gdwarf-4 -Wall (15.2.0)

Compiler output


encrypt.c: /tmp/ccs3FOA2.s: Assembler messages:
encrypt.c: /tmp/ccs3FOA2.s:3375: Warning: dwarf line number information for .data ignored
encrypt.c: /tmp/ccs3FOA2.s:3377: Warning: dwarf line number information for .data ignored
encrypt.c: /tmp/ccs3FOA2.s:3381: Warning: dwarf line number information for .data ignored
encrypt.c: /tmp/ccs3FOA2.s:3382: Warning: dwarf line number information for .data ignored
encrypt.c: /tmp/ccs3FOA2.s:3383: Warning: dwarf line number information for .data ignored
encrypt.c: /tmp/ccs3FOA2.s:3386: Warning: dwarf line number information for .data ignored
encrypt.c: /tmp/ccs3FOA2.s:3387: Warning: dwarf line number information for .data ignored
encrypt.c: /tmp/ccs3FOA2.s:3394: Warning: dwarf line number information for .data ignored
encrypt.c: /tmp/ccs3FOA2.s:3397: Warning: dwarf line number information for .data ignored
encrypt.c: /tmp/ccs3FOA2.s:3409: Warning: dwarf line number information for .data ignored
encrypt.c: /tmp/ccs3FOA2.s:3411: Warning: dwarf line number information for .data ignored
encrypt.c: /tmp/ccs3FOA2.s:3417: Warning: dwarf line number information for .data ignored
encrypt.c: /tmp/ccs3FOA2.s:3420: Warning: dwarf line number information for .data ignored
encrypt.c: /tmp/ccs3FOA2.s:3423: Warning: dwarf line number information for .data ignored
encrypt.c: /tmp/ccs3FOA2.s:3424: Warning: dwarf line number information for .data ignored
encrypt.c: /tmp/ccs3FOA2.s:3425: Warning: dwarf line number information for .data ignored
encrypt.c: /tmp/ccs3FOA2.s:3428: Warning: dwarf line number information for .data ignored
encrypt.c: /tmp/ccs3FOA2.s:3429: Warning: dwarf line number information for .data ignored
encrypt.c: /tmp/ccs3FOA2.s:3436: Warning: dwarf line number information for .data ignored
encrypt.c: /tmp/ccs3FOA2.s:3439: Warning: dwarf line number information for .data ignored
encrypt.c: /tmp/ccs3FOA2.s:3442: Warning: dwarf line number information for .data ignored
encrypt.c: /tmp/ccs3FOA2.s:9947: Error: leb128 operand is an undefined symbol: .LVU20
encrypt.c: /tmp/ccs3FOA2.s:9948: Error: leb128 operand is an undefined symbol: .LVU20
encrypt.c: /tmp/ccs3FOA2.s:9966: Error: leb128 operand is an undefined symbol: .LVU19
encrypt.c: ...

Number of similar (implementation,compiler) pairs: 1, namely:
ImplementationCompiler
T:sse4gcc -march=native -mtune=native -O -fwrapv -fPIC -fPIE -gdwarf-4 -Wall (15.2.0)

Compiler output


encrypt.c: /tmp/ccN9kgES.s: Assembler messages:
encrypt.c: /tmp/ccN9kgES.s:3375: Warning: dwarf line number information for .data ignored
encrypt.c: /tmp/ccN9kgES.s:3377: Warning: dwarf line number information for .data ignored
encrypt.c: /tmp/ccN9kgES.s:3379: Warning: dwarf line number information for .data ignored
encrypt.c: /tmp/ccN9kgES.s:3380: Warning: dwarf line number information for .data ignored
encrypt.c: /tmp/ccN9kgES.s:3381: Warning: dwarf line number information for .data ignored
encrypt.c: /tmp/ccN9kgES.s:3383: Warning: dwarf line number information for .data ignored
encrypt.c: /tmp/ccN9kgES.s:3385: Warning: dwarf line number information for .data ignored
encrypt.c: /tmp/ccN9kgES.s:3387: Warning: dwarf line number information for .data ignored
encrypt.c: /tmp/ccN9kgES.s:3388: Warning: dwarf line number information for .data ignored
encrypt.c: /tmp/ccN9kgES.s:3391: Warning: dwarf line number information for .data ignored
encrypt.c: /tmp/ccN9kgES.s:3394: Warning: dwarf line number information for .data ignored
encrypt.c: /tmp/ccN9kgES.s:3398: Warning: dwarf line number information for .data ignored
encrypt.c: /tmp/ccN9kgES.s:3401: Warning: dwarf line number information for .data ignored
encrypt.c: /tmp/ccN9kgES.s:3410: Warning: dwarf line number information for .data ignored
encrypt.c: /tmp/ccN9kgES.s:3412: Warning: dwarf line number information for .data ignored
encrypt.c: /tmp/ccN9kgES.s:3414: Warning: dwarf line number information for .data ignored
encrypt.c: /tmp/ccN9kgES.s:3415: Warning: dwarf line number information for .data ignored
encrypt.c: /tmp/ccN9kgES.s:3416: Warning: dwarf line number information for .data ignored
encrypt.c: /tmp/ccN9kgES.s:3419: Warning: dwarf line number information for .data ignored
encrypt.c: /tmp/ccN9kgES.s:3422: Warning: dwarf line number information for .data ignored
encrypt.c: /tmp/ccN9kgES.s:3426: Warning: dwarf line number information for .data ignored
encrypt.c: /tmp/ccN9kgES.s:3428: Warning: dwarf line number information for .data ignored
encrypt.c: /tmp/ccN9kgES.s:3431: Warning: dwarf line number information for .data ignored
encrypt.c: /tmp/ccN9kgES.s:3433: Warning: dwarf line number information for .data ignored
encrypt.c: ...

Number of similar (implementation,compiler) pairs: 1, namely:
ImplementationCompiler
T:sse4gcc -march=native -mtune=native -Os -fwrapv -fPIC -fPIE -gdwarf-4 -Wall (15.2.0)

Namespace violations


omdsha512.o calc_L_i T
omdsha512.o double_block T
omdsha512.o final_masking_associated_data T
omdsha512.o final_masking_message T
omdsha512.o hash T
omdsha512.o increment_masking_associated_data T
omdsha512.o increment_masking_message T
omdsha512.o key_func T
omdsha512.o l2b T
omdsha512.o ntz T
omdsha512.o omdsha512_process T
omdsha512.o triple_block T
omdsha512.o xor_block T
sha512.o sha512_comp T

Number of similar (implementation,compiler) pairs: 8, namely:
ImplementationCompiler
T:refclang -march=native -O2 -fwrapv -Qunused-arguments -fPIC -fPIE -gdwarf-4 -Wall (Ubuntu_Clang_21.1.8_(6ubuntu1))
T:refclang -march=native -O3 -fwrapv -Qunused-arguments -fPIC -fPIE -gdwarf-4 -Wall (Ubuntu_Clang_21.1.8_(6ubuntu1))
T:refclang -march=native -O -fwrapv -Qunused-arguments -fPIC -fPIE -gdwarf-4 -Wall (Ubuntu_Clang_21.1.8_(6ubuntu1))
T:refclang -march=native -Os -fwrapv -Qunused-arguments -fPIC -fPIE -gdwarf-4 -Wall (Ubuntu_Clang_21.1.8_(6ubuntu1))
T:refgcc -march=native -mtune=native -O2 -fwrapv -fPIC -fPIE -gdwarf-4 -Wall (15.2.0)
T:refgcc -march=native -mtune=native -O3 -fwrapv -fPIC -fPIE -gdwarf-4 -Wall (15.2.0)
T:refgcc -march=native -mtune=native -O -fwrapv -fPIC -fPIE -gdwarf-4 -Wall (15.2.0)
T:refgcc -march=native -mtune=native -Os -fwrapv -fPIC -fPIE -gdwarf-4 -Wall (15.2.0)