Test results for amd64, hertz, crypto_aead/morus1280256v2

[Page version: 20261007 20:07:58]

Measurements for amd64, hertz, crypto_aead Test results for amd64, hertz, crypto_aead Test results for crypto_aead/morus1280256v2
Computer: hertz
Microarchitecture: amd64; Zen 4 (a60f12)
Architecture: amd64
CPU ID: AuthenticAMD-00a60f12-178bfbff
SUPERCOP version: 20261004
Operation: crypto_aead
Primitive: morus1280256v2
TimeObject sizeTest sizeImplementationCompilerBenchmark dateSUPERCOP version
37285099 0 030595 1288 1632T:avx2clang -march=native -O -fwrapv -Qunused-arguments -fPIC -fPIE -gdwarf-4 -Wall2026100620261004
37458677 0 042155 1288 1696T:avx2clang -march=native -O3 -fwrapv -Qunused-arguments -fPIC -fPIE -gdwarf-4 -Wall2026100620261004
37886549 0 038699 1288 1696T:avx2clang -march=native -O2 -fwrapv -Qunused-arguments -fPIC -fPIE -gdwarf-4 -Wall2026100620261004
39534168 0 030429 1280 1696T:avx2clang -march=native -Os -fwrapv -Qunused-arguments -fPIC -fPIE -gdwarf-4 -Wall2026100620261004
39678691 0 034187 1288 1632T:sse2clang -march=native -O -fwrapv -Qunused-arguments -fPIC -fPIE -gdwarf-4 -Wall2026100620261004
40138374 0 040507 1288 1696T:sse2clang -march=native -O2 -fwrapv -Qunused-arguments -fPIC -fPIE -gdwarf-4 -Wall2026100620261004
40658374 0 041915 1288 1696T:sse2clang -march=native -O3 -fwrapv -Qunused-arguments -fPIC -fPIE -gdwarf-4 -Wall2026100620261004
42435639 0 036596 1272 1792T:avx2gcc -march=native -mtune=native -O3 -fwrapv -fPIC -fPIE -gdwarf-4 -Wall2026100620261004
44993849 0 030891 1264 1728T:avx2gcc -march=native -mtune=native -O -fwrapv -fPIC -fPIE -gdwarf-4 -Wall2026100620261004
46594121 0 031436 1272 1792T:avx2gcc -march=native -mtune=native -O2 -fwrapv -fPIC -fPIE -gdwarf-4 -Wall2026100620261004
76322824 0 029173 1280 1696T:sse2clang -march=native -Os -fwrapv -Qunused-arguments -fPIC -fPIE -gdwarf-4 -Wall2026100620261004
784513718 0 044605 1264 1792T:refgcc -march=native -mtune=native -O3 -fwrapv -fPIC -fPIE -gdwarf-4 -Wall2026100620261004
82283519 0 030531 1264 1728T:sse2gcc -march=native -mtune=native -O -fwrapv -fPIC -fPIE -gdwarf-4 -Wall2026100620261004
870917691 0 048613 1264 1792T:ref64gcc -march=native -mtune=native -O3 -fwrapv -fPIC -fPIE -gdwarf-4 -Wall2026100620261004
91788253 0 039204 1272 1792T:sse2gcc -march=native -mtune=native -O3 -fwrapv -fPIC -fPIE -gdwarf-4 -Wall2026100620261004
97684853 0 032180 1272 1792T:sse2gcc -march=native -mtune=native -O2 -fwrapv -fPIC -fPIE -gdwarf-4 -Wall2026100620261004
150015455 0 030808 1240 1696T:ref64gcc -march=native -mtune=native -Os -fwrapv -fPIC -fPIE -gdwarf-4 -Wall2026100620261004
163107333 0 032891 1288 1632T:ref64clang -march=native -O -fwrapv -Qunused-arguments -fPIC -fPIE -gdwarf-4 -Wall2026100620261004
168435830 0 033037 1264 1792T:ref64gcc -march=native -mtune=native -O2 -fwrapv -fPIC -fPIE -gdwarf-4 -Wall2026100620261004
169696171 0 033116 1256 1728T:ref64gcc -march=native -mtune=native -O -fwrapv -fPIC -fPIE -gdwarf-4 -Wall2026100620261004
185005988 0 038203 1288 1696T:ref64clang -march=native -O2 -fwrapv -Qunused-arguments -fPIC -fPIE -gdwarf-4 -Wall2026100620261004
185245160 0 031581 1280 1696T:ref64clang -march=native -Os -fwrapv -Qunused-arguments -fPIC -fPIE -gdwarf-4 -Wall2026100620261004
187035988 0 039611 1288 1696T:ref64clang -march=native -O3 -fwrapv -Qunused-arguments -fPIC -fPIE -gdwarf-4 -Wall2026100620261004

Compiler output


encrypt.c: encrypt.c:374:16: warning: unused variable 'check' [-Wunused-variable]
encrypt.c:   374 |         unsigned char check = 0;
encrypt.c:       |                       ^~~~~
encrypt.c: 1 warning generated.

Number of similar (implementation,compiler) pairs: 4, namely:
ImplementationCompiler
T:avx2clang -march=native -O2 -fwrapv -Qunused-arguments -fPIC -fPIE -gdwarf-4 -Wall (Ubuntu_Clang_21.1.8_(6ubuntu1))
T:avx2clang -march=native -O3 -fwrapv -Qunused-arguments -fPIC -fPIE -gdwarf-4 -Wall (Ubuntu_Clang_21.1.8_(6ubuntu1))
T:avx2clang -march=native -O -fwrapv -Qunused-arguments -fPIC -fPIE -gdwarf-4 -Wall (Ubuntu_Clang_21.1.8_(6ubuntu1))
T:avx2clang -march=native -Os -fwrapv -Qunused-arguments -fPIC -fPIE -gdwarf-4 -Wall (Ubuntu_Clang_21.1.8_(6ubuntu1))

Compiler output


encrypt.c: encrypt.c: In function 'crypto_aead_morus1280256v2_avx2_timingleaks_decrypt':
encrypt.c: encrypt.c:374:23: warning: unused variable 'check' [-Wunused-variable]
encrypt.c:   374 |         unsigned char check = 0;
encrypt.c:       |                       ^~~~~

Number of similar (implementation,compiler) pairs: 3, namely:
ImplementationCompiler
T:avx2gcc -march=native -mtune=native -O2 -fwrapv -fPIC -fPIE -gdwarf-4 -Wall (15.2.0)
T:avx2gcc -march=native -mtune=native -O3 -fwrapv -fPIC -fPIE -gdwarf-4 -Wall (15.2.0)
T:avx2gcc -march=native -mtune=native -O -fwrapv -fPIC -fPIE -gdwarf-4 -Wall (15.2.0)

Compiler output


encrypt.c: encrypt.c: In function 'crypto_aead_morus1280256v2_avx2_timingleaks_decrypt':
encrypt.c: encrypt.c:374:23: warning: unused variable 'check' [-Wunused-variable]
encrypt.c:   374 |         unsigned char check = 0;
encrypt.c:       |                       ^~~~~
try.c: /usr/bin/x86_64-linux-gnu-ld.bfd: libcrypto_aead_morus1280256v2.a(encrypt.o): in function `crypto_aead_morus1280256v2_avx2_timingleaks_encrypt':
try.c: .../supercop-data/hertz/amd64/try/c/gcc_-march=native_-mtune=native_-Os_-fwrapv_-fPIC_-fPIE_-gdwarf-4_-Wall/timingleaks/crypto_aead/morus1280256v2/avx2/work/encrypt.c:335:(.text+0x...): undefined reference to `morus_enc_aut_step'
try.c: /usr/bin/x86_64-linux-gnu-ld.bfd: .../supercop-data/hertz/amd64/try/c/gcc_-march=native_-mtune=native_-Os_-fwrapv_-fPIC_-fPIE_-gdwarf-4_-Wall/timingleaks/crypto_aead/morus1280256v2/avx2/work/encrypt.c:347:(.text+0x...): undefined reference to `morus_enc_aut_step'
try.c: /usr/bin/x86_64-linux-gnu-ld.bfd: libcrypto_aead_morus1280256v2.a(encrypt.o): in function `crypto_aead_morus1280256v2_avx2_timingleaks_decrypt':
try.c: .../supercop-data/hertz/amd64/try/c/gcc_-march=native_-mtune=native_-Os_-fwrapv_-fPIC_-fPIE_-gdwarf-4_-Wall/timingleaks/crypto_aead/morus1280256v2/avx2/work/encrypt.c:383:(.text+0x...): undefined reference to `morus_enc_aut_step'
try.c: /usr/bin/x86_64-linux-gnu-ld.bfd: .../supercop-data/hertz/amd64/try/c/gcc_-march=native_-mtune=native_-Os_-fwrapv_-fPIC_-fPIE_-gdwarf-4_-Wall/timingleaks/crypto_aead/morus1280256v2/avx2/work/encrypt.c:395:(.text+0x...): undefined reference to `morus_dec_aut_step'
try.c: collect2: error: ld returned 1 exit status

Number of similar (implementation,compiler) pairs: 1, namely:
ImplementationCompiler
T:avx2gcc -march=native -mtune=native -Os -fwrapv -fPIC -fPIE -gdwarf-4 -Wall (15.2.0)

Compiler output


encrypt.c: encrypt.c:251:10: warning: unused variable 'check' [-Wunused-variable]
encrypt.c:   251 |         uint8_t check = 0;
encrypt.c:       |                 ^~~~~
encrypt.c: 1 warning generated.
try.c: /usr/bin/x86_64-linux-gnu-ld.bfd: libcrypto_aead_morus1280256v2.a(encrypt.o): in function `morus_initialization':
try.c: .../supercop-data/hertz/amd64/try/c/clang_-march=native_-O2_-fwrapv_-Qunused-arguments_-fPIC_-fPIE_-gdwarf-4_-Wall/timingleaks/crypto_aead/morus1280256v2/ref/work/encrypt.c:66:(.text+0x...): undefined reference to `morus_stateupdate'
try.c: /usr/bin/x86_64-linux-gnu-ld.bfd: .../supercop-data/hertz/amd64/try/c/clang_-march=native_-O2_-fwrapv_-Qunused-arguments_-fPIC_-fPIE_-gdwarf-4_-Wall/timingleaks/crypto_aead/morus1280256v2/ref/work/encrypt.c:66:(.text+0x...): undefined reference to `morus_stateupdate'
try.c: /usr/bin/x86_64-linux-gnu-ld.bfd: .../supercop-data/hertz/amd64/try/c/clang_-march=native_-O2_-fwrapv_-Qunused-arguments_-fPIC_-fPIE_-gdwarf-4_-Wall/timingleaks/crypto_aead/morus1280256v2/ref/work/encrypt.c:66:(.text+0x...): undefined reference to `morus_stateupdate'
try.c: /usr/bin/x86_64-linux-gnu-ld.bfd: .../supercop-data/hertz/amd64/try/c/clang_-march=native_-O2_-fwrapv_-Qunused-arguments_-fPIC_-fPIE_-gdwarf-4_-Wall/timingleaks/crypto_aead/morus1280256v2/ref/work/encrypt.c:66:(.text+0x...): undefined reference to `morus_stateupdate'
try.c: /usr/bin/x86_64-linux-gnu-ld.bfd: .../supercop-data/hertz/amd64/try/c/clang_-march=native_-O2_-fwrapv_-Qunused-arguments_-fPIC_-fPIE_-gdwarf-4_-Wall/timingleaks/crypto_aead/morus1280256v2/ref/work/encrypt.c:66:(.text+0x...): undefined reference to `morus_stateupdate'
try.c: /usr/bin/x86_64-linux-gnu-ld.bfd: libcrypto_aead_morus1280256v2.a(encrypt.o):.../supercop-data/hertz/amd64/try/c/clang_-march=native_-O2_-fwrapv_-Qunused-arguments_-fPIC_-fPIE_-gdwarf-4_-Wall/timingleaks/crypto_aead/morus1280256v2/ref/work/encrypt.c:66: more undefined references to `morus_stateupdate' follow
try.c: clang: error: linker command failed with exit code 1 (use -v to see invocation)

Number of similar (implementation,compiler) pairs: 1, namely:
ImplementationCompiler
T:refclang -march=native -O2 -fwrapv -Qunused-arguments -fPIC -fPIE -gdwarf-4 -Wall (Ubuntu_Clang_21.1.8_(6ubuntu1))

Compiler output


encrypt.c: encrypt.c:251:10: warning: unused variable 'check' [-Wunused-variable]
encrypt.c:   251 |         uint8_t check = 0;
encrypt.c:       |                 ^~~~~
encrypt.c: 1 warning generated.
try.c: /usr/bin/x86_64-linux-gnu-ld.bfd: libcrypto_aead_morus1280256v2.a(encrypt.o): in function `morus_initialization':
try.c: .../supercop-data/hertz/amd64/try/c/clang_-march=native_-O3_-fwrapv_-Qunused-arguments_-fPIC_-fPIE_-gdwarf-4_-Wall/timingleaks/crypto_aead/morus1280256v2/ref/work/encrypt.c:66:(.text+0x...): undefined reference to `morus_stateupdate'
try.c: /usr/bin/x86_64-linux-gnu-ld.bfd: .../supercop-data/hertz/amd64/try/c/clang_-march=native_-O3_-fwrapv_-Qunused-arguments_-fPIC_-fPIE_-gdwarf-4_-Wall/timingleaks/crypto_aead/morus1280256v2/ref/work/encrypt.c:66:(.text+0x...): undefined reference to `morus_stateupdate'
try.c: /usr/bin/x86_64-linux-gnu-ld.bfd: .../supercop-data/hertz/amd64/try/c/clang_-march=native_-O3_-fwrapv_-Qunused-arguments_-fPIC_-fPIE_-gdwarf-4_-Wall/timingleaks/crypto_aead/morus1280256v2/ref/work/encrypt.c:66:(.text+0x...): undefined reference to `morus_stateupdate'
try.c: /usr/bin/x86_64-linux-gnu-ld.bfd: .../supercop-data/hertz/amd64/try/c/clang_-march=native_-O3_-fwrapv_-Qunused-arguments_-fPIC_-fPIE_-gdwarf-4_-Wall/timingleaks/crypto_aead/morus1280256v2/ref/work/encrypt.c:66:(.text+0x...): undefined reference to `morus_stateupdate'
try.c: /usr/bin/x86_64-linux-gnu-ld.bfd: .../supercop-data/hertz/amd64/try/c/clang_-march=native_-O3_-fwrapv_-Qunused-arguments_-fPIC_-fPIE_-gdwarf-4_-Wall/timingleaks/crypto_aead/morus1280256v2/ref/work/encrypt.c:66:(.text+0x...): undefined reference to `morus_stateupdate'
try.c: /usr/bin/x86_64-linux-gnu-ld.bfd: libcrypto_aead_morus1280256v2.a(encrypt.o):.../supercop-data/hertz/amd64/try/c/clang_-march=native_-O3_-fwrapv_-Qunused-arguments_-fPIC_-fPIE_-gdwarf-4_-Wall/timingleaks/crypto_aead/morus1280256v2/ref/work/encrypt.c:66: more undefined references to `morus_stateupdate' follow
try.c: clang: error: linker command failed with exit code 1 (use -v to see invocation)

Number of similar (implementation,compiler) pairs: 1, namely:
ImplementationCompiler
T:refclang -march=native -O3 -fwrapv -Qunused-arguments -fPIC -fPIE -gdwarf-4 -Wall (Ubuntu_Clang_21.1.8_(6ubuntu1))

Compiler output


encrypt.c: encrypt.c:251:10: warning: unused variable 'check' [-Wunused-variable]
encrypt.c:   251 |         uint8_t check = 0;
encrypt.c:       |                 ^~~~~
encrypt.c: 1 warning generated.
try.c: /usr/bin/x86_64-linux-gnu-ld.bfd: libcrypto_aead_morus1280256v2.a(encrypt.o): in function `morus_initialization':
try.c: .../supercop-data/hertz/amd64/try/c/clang_-march=native_-O_-fwrapv_-Qunused-arguments_-fPIC_-fPIE_-gdwarf-4_-Wall/timingleaks/crypto_aead/morus1280256v2/ref/work/encrypt.c:66:(.text+0x...): undefined reference to `morus_stateupdate'
try.c: /usr/bin/x86_64-linux-gnu-ld.bfd: libcrypto_aead_morus1280256v2.a(encrypt.o): in function `morus_tag_generation':
try.c: .../supercop-data/hertz/amd64/try/c/clang_-march=native_-O_-fwrapv_-Qunused-arguments_-fPIC_-fPIE_-gdwarf-4_-Wall/timingleaks/crypto_aead/morus1280256v2/ref/work/encrypt.c:85:(.text+0x...): undefined reference to `morus_stateupdate'
try.c: /usr/bin/x86_64-linux-gnu-ld.bfd: libcrypto_aead_morus1280256v2.a(encrypt.o): in function `morus_tag_verification':
try.c: .../supercop-data/hertz/amd64/try/c/clang_-march=native_-O_-fwrapv_-Qunused-arguments_-fPIC_-fPIE_-gdwarf-4_-Wall/timingleaks/crypto_aead/morus1280256v2/ref/work/encrypt.c:107:(.text+0x...): undefined reference to `morus_stateupdate'
try.c: /usr/bin/x86_64-linux-gnu-ld.bfd: libcrypto_aead_morus1280256v2.a(encrypt.o): in function `morus_enc_aut_partialblock':
try.c: .../supercop-data/hertz/amd64/try/c/clang_-march=native_-O_-fwrapv_-Qunused-arguments_-fPIC_-fPIE_-gdwarf-4_-Wall/timingleaks/crypto_aead/morus1280256v2/ref/work/encrypt.c:165:(.text+0x...): undefined reference to `morus_stateupdate'
try.c: /usr/bin/x86_64-linux-gnu-ld.bfd: libcrypto_aead_morus1280256v2.a(encrypt.o): in function `morus_dec_aut_partialblock':
try.c: .../supercop-data/hertz/amd64/try/c/clang_-march=native_-O_-fwrapv_-Qunused-arguments_-fPIC_-fPIE_-gdwarf-4_-Wall/timingleaks/crypto_aead/morus1280256v2/ref/work/encrypt.c:189:(.text+0x...): undefined reference to `morus_stateupdate'
try.c: clang: error: linker command failed with exit code 1 (use -v to see invocation)

Number of similar (implementation,compiler) pairs: 1, namely:
ImplementationCompiler
T:refclang -march=native -O -fwrapv -Qunused-arguments -fPIC -fPIE -gdwarf-4 -Wall (Ubuntu_Clang_21.1.8_(6ubuntu1))

Compiler output


encrypt.c: encrypt.c:251:10: warning: unused variable 'check' [-Wunused-variable]
encrypt.c:   251 |         uint8_t check = 0;
encrypt.c:       |                 ^~~~~
encrypt.c: 1 warning generated.
try.c: /usr/bin/x86_64-linux-gnu-ld.bfd: libcrypto_aead_morus1280256v2.a(encrypt.o): in function `morus_initialization':
try.c: .../supercop-data/hertz/amd64/try/c/clang_-march=native_-Os_-fwrapv_-Qunused-arguments_-fPIC_-fPIE_-gdwarf-4_-Wall/timingleaks/crypto_aead/morus1280256v2/ref/work/encrypt.c:66:(.text+0x...): undefined reference to `morus_stateupdate'
try.c: /usr/bin/x86_64-linux-gnu-ld.bfd: libcrypto_aead_morus1280256v2.a(encrypt.o): in function `morus_tag_generation':
try.c: .../supercop-data/hertz/amd64/try/c/clang_-march=native_-Os_-fwrapv_-Qunused-arguments_-fPIC_-fPIE_-gdwarf-4_-Wall/timingleaks/crypto_aead/morus1280256v2/ref/work/encrypt.c:85:(.text+0x...): undefined reference to `morus_stateupdate'
try.c: /usr/bin/x86_64-linux-gnu-ld.bfd: libcrypto_aead_morus1280256v2.a(encrypt.o): in function `morus_tag_verification':
try.c: .../supercop-data/hertz/amd64/try/c/clang_-march=native_-Os_-fwrapv_-Qunused-arguments_-fPIC_-fPIE_-gdwarf-4_-Wall/timingleaks/crypto_aead/morus1280256v2/ref/work/encrypt.c:107:(.text+0x...): undefined reference to `morus_stateupdate'
try.c: /usr/bin/x86_64-linux-gnu-ld.bfd: libcrypto_aead_morus1280256v2.a(encrypt.o): in function `morus_enc_aut_partialblock':
try.c: .../supercop-data/hertz/amd64/try/c/clang_-march=native_-Os_-fwrapv_-Qunused-arguments_-fPIC_-fPIE_-gdwarf-4_-Wall/timingleaks/crypto_aead/morus1280256v2/ref/work/encrypt.c:165:(.text+0x...): undefined reference to `morus_stateupdate'
try.c: /usr/bin/x86_64-linux-gnu-ld.bfd: libcrypto_aead_morus1280256v2.a(encrypt.o): in function `morus_dec_aut_partialblock':
try.c: .../supercop-data/hertz/amd64/try/c/clang_-march=native_-Os_-fwrapv_-Qunused-arguments_-fPIC_-fPIE_-gdwarf-4_-Wall/timingleaks/crypto_aead/morus1280256v2/ref/work/encrypt.c:189:(.text+0x...): undefined reference to `morus_stateupdate'
try.c: clang: error: linker command failed with exit code 1 (use -v to see invocation)

Number of similar (implementation,compiler) pairs: 1, namely:
ImplementationCompiler
T:refclang -march=native -Os -fwrapv -Qunused-arguments -fPIC -fPIE -gdwarf-4 -Wall (Ubuntu_Clang_21.1.8_(6ubuntu1))

Compiler output


encrypt.c: encrypt.c: In function 'crypto_aead_morus1280256v2_ref_timingleaks_decrypt':
encrypt.c: encrypt.c:251:17: warning: unused variable 'check' [-Wunused-variable]
encrypt.c:   251 |         uint8_t check = 0;
encrypt.c:       |                 ^~~~~
try.c: /usr/bin/x86_64-linux-gnu-ld.bfd: libcrypto_aead_morus1280256v2.a(encrypt.o): in function `morus_enc_aut_partialblock':
try.c: .../supercop-data/hertz/amd64/try/c/gcc_-march=native_-mtune=native_-O2_-fwrapv_-fPIC_-fPIE_-gdwarf-4_-Wall/timingleaks/crypto_aead/morus1280256v2/ref/work/encrypt.c:165:(.text+0x...): undefined reference to `morus_stateupdate'
try.c: /usr/bin/x86_64-linux-gnu-ld.bfd: libcrypto_aead_morus1280256v2.a(encrypt.o): in function `morus_dec_aut_partialblock':
try.c: .../supercop-data/hertz/amd64/try/c/gcc_-march=native_-mtune=native_-O2_-fwrapv_-fPIC_-fPIE_-gdwarf-4_-Wall/timingleaks/crypto_aead/morus1280256v2/ref/work/encrypt.c:189:(.text+0x...): undefined reference to `morus_stateupdate'
try.c: /usr/bin/x86_64-linux-gnu-ld.bfd: libcrypto_aead_morus1280256v2.a(encrypt.o): in function `morus_enc_aut_step':
try.c: .../supercop-data/hertz/amd64/try/c/gcc_-march=native_-mtune=native_-O2_-fwrapv_-fPIC_-fPIE_-gdwarf-4_-Wall/timingleaks/crypto_aead/morus1280256v2/ref/work/encrypt.c:130:(.text+0x...): undefined reference to `morus_stateupdate'
try.c: /usr/bin/x86_64-linux-gnu-ld.bfd: .../supercop-data/hertz/amd64/try/c/gcc_-march=native_-mtune=native_-O2_-fwrapv_-fPIC_-fPIE_-gdwarf-4_-Wall/timingleaks/crypto_aead/morus1280256v2/ref/work/encrypt.c:130:(.text+0x...): undefined reference to `morus_stateupdate'
try.c: collect2: error: ld returned 1 exit status

Number of similar (implementation,compiler) pairs: 1, namely:
ImplementationCompiler
T:refgcc -march=native -mtune=native -O2 -fwrapv -fPIC -fPIE -gdwarf-4 -Wall (15.2.0)

Compiler output


encrypt.c: encrypt.c: In function 'crypto_aead_morus1280256v2_ref_timingleaks_decrypt':
encrypt.c: encrypt.c:251:17: warning: unused variable 'check' [-Wunused-variable]
encrypt.c:   251 |         uint8_t check = 0;
encrypt.c:       |                 ^~~~~

Number of similar (implementation,compiler) pairs: 1, namely:
ImplementationCompiler
T:refgcc -march=native -mtune=native -O3 -fwrapv -fPIC -fPIE -gdwarf-4 -Wall (15.2.0)

Compiler output


encrypt.c: encrypt.c: In function 'crypto_aead_morus1280256v2_ref_timingleaks_decrypt':
encrypt.c: encrypt.c:251:17: warning: unused variable 'check' [-Wunused-variable]
encrypt.c:   251 |         uint8_t check = 0;
encrypt.c:       |                 ^~~~~
try.c: /usr/bin/x86_64-linux-gnu-ld.bfd: libcrypto_aead_morus1280256v2.a(encrypt.o): in function `morus_enc_aut_partialblock':
try.c: .../supercop-data/hertz/amd64/try/c/gcc_-march=native_-mtune=native_-O_-fwrapv_-fPIC_-fPIE_-gdwarf-4_-Wall/timingleaks/crypto_aead/morus1280256v2/ref/work/encrypt.c:165:(.text+0x...): undefined reference to `morus_stateupdate'
try.c: /usr/bin/x86_64-linux-gnu-ld.bfd: libcrypto_aead_morus1280256v2.a(encrypt.o): in function `morus_dec_aut_partialblock':
try.c: .../supercop-data/hertz/amd64/try/c/gcc_-march=native_-mtune=native_-O_-fwrapv_-fPIC_-fPIE_-gdwarf-4_-Wall/timingleaks/crypto_aead/morus1280256v2/ref/work/encrypt.c:189:(.text+0x...): undefined reference to `morus_stateupdate'
try.c: /usr/bin/x86_64-linux-gnu-ld.bfd: libcrypto_aead_morus1280256v2.a(encrypt.o): in function `morus_enc_aut_step':
try.c: .../supercop-data/hertz/amd64/try/c/gcc_-march=native_-mtune=native_-O_-fwrapv_-fPIC_-fPIE_-gdwarf-4_-Wall/timingleaks/crypto_aead/morus1280256v2/ref/work/encrypt.c:130:(.text+0x...): undefined reference to `morus_stateupdate'
try.c: /usr/bin/x86_64-linux-gnu-ld.bfd: .../supercop-data/hertz/amd64/try/c/gcc_-march=native_-mtune=native_-O_-fwrapv_-fPIC_-fPIE_-gdwarf-4_-Wall/timingleaks/crypto_aead/morus1280256v2/ref/work/encrypt.c:130:(.text+0x...): undefined reference to `morus_stateupdate'
try.c: collect2: error: ld returned 1 exit status

Number of similar (implementation,compiler) pairs: 1, namely:
ImplementationCompiler
T:refgcc -march=native -mtune=native -O -fwrapv -fPIC -fPIE -gdwarf-4 -Wall (15.2.0)

Compiler output


encrypt.c: encrypt.c: In function 'crypto_aead_morus1280256v2_ref_timingleaks_decrypt':
encrypt.c: encrypt.c:251:17: warning: unused variable 'check' [-Wunused-variable]
encrypt.c:   251 |         uint8_t check = 0;
encrypt.c:       |                 ^~~~~
try.c: /usr/bin/x86_64-linux-gnu-ld.bfd: libcrypto_aead_morus1280256v2.a(encrypt.o): in function `morus_initialization':
try.c: .../supercop-data/hertz/amd64/try/c/gcc_-march=native_-mtune=native_-Os_-fwrapv_-fPIC_-fPIE_-gdwarf-4_-Wall/timingleaks/crypto_aead/morus1280256v2/ref/work/encrypt.c:66:(.text+0x...): undefined reference to `morus_stateupdate'
try.c: /usr/bin/x86_64-linux-gnu-ld.bfd: libcrypto_aead_morus1280256v2.a(encrypt.o): in function `morus_tag_generation':
try.c: .../supercop-data/hertz/amd64/try/c/gcc_-march=native_-mtune=native_-Os_-fwrapv_-fPIC_-fPIE_-gdwarf-4_-Wall/timingleaks/crypto_aead/morus1280256v2/ref/work/encrypt.c:85:(.text+0x...): undefined reference to `morus_stateupdate'
try.c: /usr/bin/x86_64-linux-gnu-ld.bfd: libcrypto_aead_morus1280256v2.a(encrypt.o): in function `morus_tag_verification':
try.c: .../supercop-data/hertz/amd64/try/c/gcc_-march=native_-mtune=native_-Os_-fwrapv_-fPIC_-fPIE_-gdwarf-4_-Wall/timingleaks/crypto_aead/morus1280256v2/ref/work/encrypt.c:107:(.text+0x...): undefined reference to `morus_stateupdate'
try.c: /usr/bin/x86_64-linux-gnu-ld.bfd: libcrypto_aead_morus1280256v2.a(encrypt.o): in function `morus_enc_aut_partialblock':
try.c: .../supercop-data/hertz/amd64/try/c/gcc_-march=native_-mtune=native_-Os_-fwrapv_-fPIC_-fPIE_-gdwarf-4_-Wall/timingleaks/crypto_aead/morus1280256v2/ref/work/encrypt.c:165:(.text+0x...): undefined reference to `morus_stateupdate'
try.c: /usr/bin/x86_64-linux-gnu-ld.bfd: libcrypto_aead_morus1280256v2.a(encrypt.o): in function `morus_dec_aut_partialblock':
try.c: .../supercop-data/hertz/amd64/try/c/gcc_-march=native_-mtune=native_-Os_-fwrapv_-fPIC_-fPIE_-gdwarf-4_-Wall/timingleaks/crypto_aead/morus1280256v2/ref/work/encrypt.c:189:(.text+0x...): undefined reference to `morus_stateupdate'
try.c: /usr/bin/x86_64-linux-gnu-ld.bfd: libcrypto_aead_morus1280256v2.a(encrypt.o): in function `crypto_aead_morus1280256v2_ref_timingleaks_encrypt':
try.c: .../supercop-data/hertz/amd64/try/c/gcc_-march=native_-mtune=native_-Os_-fwrapv_-fPIC_-fPIE_-gdwarf-4_-Wall/timingleaks/crypto_aead/morus1280256v2/ref/work/encrypt.c:213:(.text+0x...): undefined reference to `morus_enc_aut_step'
try.c: /usr/bin/x86_64-linux-gnu-ld.bfd: .../supercop-data/hertz/amd64/try/c/gcc_-march=native_-mtune=native_-Os_-fwrapv_-fPIC_-fPIE_-gdwarf-4_-Wall/timingleaks/crypto_aead/morus1280256v2/ref/work/encrypt.c:224:(.text+0x...): undefined reference to `morus_enc_aut_step'
try.c: /usr/bin/x86_64-linux-gnu-ld.bfd: libcrypto_aead_morus1280256v2.a(encrypt.o): in function `crypto_aead_morus1280256v2_ref_timingleaks_decrypt':
try.c: .../supercop-data/hertz/amd64/try/c/gcc_-march=native_-mtune=native_-Os_-fwrapv_-fPIC_-fPIE_-gdwarf-4_-Wall/timingleaks/crypto_aead/morus1280256v2/ref/work/encrypt.c:258:(.text+0x...): undefined reference to `morus_enc_aut_step'
try.c: /usr/bin/x86_64-linux-gnu-ld.bfd: .../supercop-data/hertz/amd64/try/c/gcc_-march=native_-mtune=native_-Os_-fwrapv_-fPIC_-fPIE_-gdwarf-4_-Wall/timingleaks/crypto_aead/morus1280256v2/ref/work/encrypt.c:270:(.text+0x...): undefined reference to `morus_dec_aut_step'
try.c: collect2: error: ld returned 1 exit status

Number of similar (implementation,compiler) pairs: 1, namely:
ImplementationCompiler
T:refgcc -march=native -mtune=native -Os -fwrapv -fPIC -fPIE -gdwarf-4 -Wall (15.2.0)

Compiler output


encrypt.c: encrypt.c:312:10: warning: unused variable 'check' [-Wunused-variable]
encrypt.c:   312 |         uint8_t check = 0;
encrypt.c:       |                 ^~~~~
encrypt.c: 1 warning generated.

Number of similar (implementation,compiler) pairs: 4, namely:
ImplementationCompiler
T:ref64clang -march=native -O2 -fwrapv -Qunused-arguments -fPIC -fPIE -gdwarf-4 -Wall (Ubuntu_Clang_21.1.8_(6ubuntu1))
T:ref64clang -march=native -O3 -fwrapv -Qunused-arguments -fPIC -fPIE -gdwarf-4 -Wall (Ubuntu_Clang_21.1.8_(6ubuntu1))
T:ref64clang -march=native -O -fwrapv -Qunused-arguments -fPIC -fPIE -gdwarf-4 -Wall (Ubuntu_Clang_21.1.8_(6ubuntu1))
T:ref64clang -march=native -Os -fwrapv -Qunused-arguments -fPIC -fPIE -gdwarf-4 -Wall (Ubuntu_Clang_21.1.8_(6ubuntu1))

Compiler output


encrypt.c: encrypt.c: In function 'crypto_aead_morus1280256v2_ref64_timingleaks_decrypt':
encrypt.c: encrypt.c:312:17: warning: unused variable 'check' [-Wunused-variable]
encrypt.c:   312 |         uint8_t check = 0;
encrypt.c:       |                 ^~~~~

Number of similar (implementation,compiler) pairs: 4, namely:
ImplementationCompiler
T:ref64gcc -march=native -mtune=native -O2 -fwrapv -fPIC -fPIE -gdwarf-4 -Wall (15.2.0)
T:ref64gcc -march=native -mtune=native -O3 -fwrapv -fPIC -fPIE -gdwarf-4 -Wall (15.2.0)
T:ref64gcc -march=native -mtune=native -O -fwrapv -fPIC -fPIE -gdwarf-4 -Wall (15.2.0)
T:ref64gcc -march=native -mtune=native -Os -fwrapv -fPIC -fPIE -gdwarf-4 -Wall (15.2.0)

Compiler output


try.c: /usr/bin/x86_64-linux-gnu-ld.bfd: libcrypto_aead_morus1280256v2.a(encrypt.o): in function `crypto_aead_morus1280256v2_sse2_timingleaks_encrypt':
try.c: .../supercop-data/hertz/amd64/try/c/gcc_-march=native_-mtune=native_-Os_-fwrapv_-fPIC_-fPIE_-gdwarf-4_-Wall/timingleaks/crypto_aead/morus1280256v2/sse2/work/encrypt.c:290:(.text+0x...): undefined reference to `morus_enc_aut_step'
try.c: /usr/bin/x86_64-linux-gnu-ld.bfd: .../supercop-data/hertz/amd64/try/c/gcc_-march=native_-mtune=native_-Os_-fwrapv_-fPIC_-fPIE_-gdwarf-4_-Wall/timingleaks/crypto_aead/morus1280256v2/sse2/work/encrypt.c:301:(.text+0x...): undefined reference to `morus_enc_aut_step'
try.c: /usr/bin/x86_64-linux-gnu-ld.bfd: libcrypto_aead_morus1280256v2.a(encrypt.o): in function `crypto_aead_morus1280256v2_sse2_timingleaks_decrypt':
try.c: .../supercop-data/hertz/amd64/try/c/gcc_-march=native_-mtune=native_-Os_-fwrapv_-fPIC_-fPIE_-gdwarf-4_-Wall/timingleaks/crypto_aead/morus1280256v2/sse2/work/encrypt.c:334:(.text+0x...): undefined reference to `morus_enc_aut_step'
try.c: /usr/bin/x86_64-linux-gnu-ld.bfd: .../supercop-data/hertz/amd64/try/c/gcc_-march=native_-mtune=native_-Os_-fwrapv_-fPIC_-fPIE_-gdwarf-4_-Wall/timingleaks/crypto_aead/morus1280256v2/sse2/work/encrypt.c:346:(.text+0x...): undefined reference to `morus_dec_aut_step'
try.c: collect2: error: ld returned 1 exit status

Number of similar (implementation,compiler) pairs: 1, namely:
ImplementationCompiler
T:sse2gcc -march=native -mtune=native -Os -fwrapv -fPIC -fPIE -gdwarf-4 -Wall (15.2.0)

Namespace violations


encrypt.o morus_dec_aut_partialblock T
encrypt.o morus_enc_aut_partialblock T
encrypt.o morus_initialization T
encrypt.o morus_stateupdate T
encrypt.o morus_tag_generation T
encrypt.o morus_tag_verification T

Number of similar (implementation,compiler) pairs: 14, namely:
ImplementationCompiler
T:avx2clang -march=native -O2 -fwrapv -Qunused-arguments -fPIC -fPIE -gdwarf-4 -Wall (Ubuntu_Clang_21.1.8_(6ubuntu1))
T:avx2clang -march=native -O3 -fwrapv -Qunused-arguments -fPIC -fPIE -gdwarf-4 -Wall (Ubuntu_Clang_21.1.8_(6ubuntu1))
T:avx2clang -march=native -O -fwrapv -Qunused-arguments -fPIC -fPIE -gdwarf-4 -Wall (Ubuntu_Clang_21.1.8_(6ubuntu1))
T:avx2clang -march=native -Os -fwrapv -Qunused-arguments -fPIC -fPIE -gdwarf-4 -Wall (Ubuntu_Clang_21.1.8_(6ubuntu1))
T:avx2gcc -march=native -mtune=native -O2 -fwrapv -fPIC -fPIE -gdwarf-4 -Wall (15.2.0)
T:avx2gcc -march=native -mtune=native -O3 -fwrapv -fPIC -fPIE -gdwarf-4 -Wall (15.2.0)
T:avx2gcc -march=native -mtune=native -O -fwrapv -fPIC -fPIE -gdwarf-4 -Wall (15.2.0)
T:sse2clang -march=native -O2 -fwrapv -Qunused-arguments -fPIC -fPIE -gdwarf-4 -Wall (Ubuntu_Clang_21.1.8_(6ubuntu1))
T:sse2clang -march=native -O3 -fwrapv -Qunused-arguments -fPIC -fPIE -gdwarf-4 -Wall (Ubuntu_Clang_21.1.8_(6ubuntu1))
T:sse2clang -march=native -O -fwrapv -Qunused-arguments -fPIC -fPIE -gdwarf-4 -Wall (Ubuntu_Clang_21.1.8_(6ubuntu1))
T:sse2clang -march=native -Os -fwrapv -Qunused-arguments -fPIC -fPIE -gdwarf-4 -Wall (Ubuntu_Clang_21.1.8_(6ubuntu1))
T:sse2gcc -march=native -mtune=native -O2 -fwrapv -fPIC -fPIE -gdwarf-4 -Wall (15.2.0)
T:sse2gcc -march=native -mtune=native -O3 -fwrapv -fPIC -fPIE -gdwarf-4 -Wall (15.2.0)
T:sse2gcc -march=native -mtune=native -O -fwrapv -fPIC -fPIE -gdwarf-4 -Wall (15.2.0)

Namespace violations


encrypt.o morus_dec_aut_partialblock T
encrypt.o morus_enc_aut_partialblock T
encrypt.o morus_initialization T
encrypt.o morus_tag_generation T
encrypt.o morus_tag_verification T

Number of similar (implementation,compiler) pairs: 1, namely:
ImplementationCompiler
T:refgcc -march=native -mtune=native -O3 -fwrapv -fPIC -fPIE -gdwarf-4 -Wall (15.2.0)

Namespace violations


encrypt.o morus_dec_aut_partialblock T
encrypt.o morus_dec_aut_step T
encrypt.o morus_enc_aut_partialblock T
encrypt.o morus_enc_aut_step T
encrypt.o morus_initialization T
encrypt.o morus_stateupdate T
encrypt.o morus_tag_generation T
encrypt.o morus_tag_verification T

Number of similar (implementation,compiler) pairs: 8, namely:
ImplementationCompiler
T:ref64clang -march=native -O2 -fwrapv -Qunused-arguments -fPIC -fPIE -gdwarf-4 -Wall (Ubuntu_Clang_21.1.8_(6ubuntu1))
T:ref64clang -march=native -O3 -fwrapv -Qunused-arguments -fPIC -fPIE -gdwarf-4 -Wall (Ubuntu_Clang_21.1.8_(6ubuntu1))
T:ref64clang -march=native -O -fwrapv -Qunused-arguments -fPIC -fPIE -gdwarf-4 -Wall (Ubuntu_Clang_21.1.8_(6ubuntu1))
T:ref64clang -march=native -Os -fwrapv -Qunused-arguments -fPIC -fPIE -gdwarf-4 -Wall (Ubuntu_Clang_21.1.8_(6ubuntu1))
T:ref64gcc -march=native -mtune=native -O2 -fwrapv -fPIC -fPIE -gdwarf-4 -Wall (15.2.0)
T:ref64gcc -march=native -mtune=native -O3 -fwrapv -fPIC -fPIE -gdwarf-4 -Wall (15.2.0)
T:ref64gcc -march=native -mtune=native -O -fwrapv -fPIC -fPIE -gdwarf-4 -Wall (15.2.0)
T:ref64gcc -march=native -mtune=native -Os -fwrapv -fPIC -fPIE -gdwarf-4 -Wall (15.2.0)