Test results for amd64, hertz, crypto_aead/morus1280128v2

[Page version: 20261007 20:07:58]

Measurements for amd64, hertz, crypto_aead Test results for amd64, hertz, crypto_aead Test results for crypto_aead/morus1280128v2
Computer: hertz
Microarchitecture: amd64; Zen 4 (a60f12)
Architecture: amd64
CPU ID: AuthenticAMD-00a60f12-178bfbff
SUPERCOP version: 20261004
Operation: crypto_aead
Primitive: morus1280128v2
TimeObject sizeTest sizeImplementationCompilerBenchmark dateSUPERCOP version
37225099 0 030595 1288 1632T:avx2clang -march=native -O -fwrapv -Qunused-arguments -fPIC -fPIE -gdwarf-4 -Wall2026100620261004
37986537 0 038691 1288 1696T:avx2clang -march=native -O2 -fwrapv -Qunused-arguments -fPIC -fPIE -gdwarf-4 -Wall2026100620261004
37988649 0 042147 1288 1696T:avx2clang -march=native -O3 -fwrapv -Qunused-arguments -fPIC -fPIE -gdwarf-4 -Wall2026100620261004
38633952 0 030293 1280 1696T:avx2clang -march=native -Os -fwrapv -Qunused-arguments -fPIC -fPIE -gdwarf-4 -Wall2026100620261004
40068755 0 034251 1288 1632T:sse2clang -march=native -O -fwrapv -Qunused-arguments -fPIC -fPIE -gdwarf-4 -Wall2026100620261004
40145329 0 031605 1280 1696T:sse2clang -march=native -Os -fwrapv -Qunused-arguments -fPIC -fPIE -gdwarf-4 -Wall2026100620261004
41068374 0 040507 1288 1696T:sse2clang -march=native -O2 -fwrapv -Qunused-arguments -fPIC -fPIE -gdwarf-4 -Wall2026100620261004
41068374 0 041915 1288 1696T:sse2clang -march=native -O3 -fwrapv -Qunused-arguments -fPIC -fPIE -gdwarf-4 -Wall2026100620261004
42725664 0 036716 1272 1792T:avx2gcc -march=native -mtune=native -O3 -fwrapv -fPIC -fPIE -gdwarf-4 -Wall2026100620261004
45433864 0 031011 1264 1728T:avx2gcc -march=native -mtune=native -O -fwrapv -fPIC -fPIE -gdwarf-4 -Wall2026100620261004
46884159 0 031556 1272 1792T:avx2gcc -march=native -mtune=native -O2 -fwrapv -fPIC -fPIE -gdwarf-4 -Wall2026100620261004
51008399 0 039428 1272 1792T:sse2gcc -march=native -mtune=native -O3 -fwrapv -fPIC -fPIE -gdwarf-4 -Wall2026100620261004
789215982 0 046941 1264 1792T:ref64gcc -march=native -mtune=native -O3 -fwrapv -fPIC -fPIE -gdwarf-4 -Wall2026100620261004
793115982 0 046941 1264 1792T:refgcc -march=native -mtune=native -O3 -fwrapv -fPIC -fPIE -gdwarf-4 -Wall2026100620261004
150415480 0 030912 1240 1696T:refgcc -march=native -mtune=native -Os -fwrapv -fPIC -fPIE -gdwarf-4 -Wall2026100620261004
150705480 0 030912 1240 1696T:ref64gcc -march=native -mtune=native -Os -fwrapv -fPIC -fPIE -gdwarf-4 -Wall2026100620261004
164707348 0 032947 1288 1632T:refclang -march=native -O -fwrapv -Qunused-arguments -fPIC -fPIE -gdwarf-4 -Wall2026100620261004
166327348 0 032947 1288 1632T:ref64clang -march=native -O -fwrapv -Qunused-arguments -fPIC -fPIE -gdwarf-4 -Wall2026100620261004
167135894 0 033221 1264 1792T:ref64gcc -march=native -mtune=native -O2 -fwrapv -fPIC -fPIE -gdwarf-4 -Wall2026100620261004
167895894 0 033221 1264 1792T:refgcc -march=native -mtune=native -O2 -fwrapv -fPIC -fPIE -gdwarf-4 -Wall2026100620261004
169886195 0 033292 1256 1728T:ref64gcc -march=native -mtune=native -O -fwrapv -fPIC -fPIE -gdwarf-4 -Wall2026100620261004
169996195 0 033292 1256 1728T:refgcc -march=native -mtune=native -O -fwrapv -fPIC -fPIE -gdwarf-4 -Wall2026100620261004
182606048 0 038195 1288 1696T:refclang -march=native -O2 -fwrapv -Qunused-arguments -fPIC -fPIE -gdwarf-4 -Wall2026100620261004
182735159 0 031565 1280 1696T:refclang -march=native -Os -fwrapv -Qunused-arguments -fPIC -fPIE -gdwarf-4 -Wall2026100620261004
183146048 0 039667 1288 1696T:ref64clang -march=native -O3 -fwrapv -Qunused-arguments -fPIC -fPIE -gdwarf-4 -Wall2026100620261004
183366048 0 038195 1288 1696T:ref64clang -march=native -O2 -fwrapv -Qunused-arguments -fPIC -fPIE -gdwarf-4 -Wall2026100620261004
184526048 0 039667 1288 1696T:refclang -march=native -O3 -fwrapv -Qunused-arguments -fPIC -fPIE -gdwarf-4 -Wall2026100620261004
185725159 0 031565 1280 1696T:ref64clang -march=native -Os -fwrapv -Qunused-arguments -fPIC -fPIE -gdwarf-4 -Wall2026100620261004

Compiler output


encrypt.c: encrypt.c:309:24: warning: unused variable 'j' [-Wunused-variable]
encrypt.c:   309 |         unsigned long long i, j;
encrypt.c:       |                               ^
encrypt.c: encrypt.c:357:24: warning: unused variable 'j' [-Wunused-variable]
encrypt.c:   357 |         unsigned long long i, j;
encrypt.c:       |                               ^
encrypt.c: encrypt.c:359:16: warning: unused variable 'tag' [-Wunused-variable]
encrypt.c:   359 |         unsigned char tag[16];
encrypt.c:       |                       ^~~
encrypt.c: encrypt.c:360:16: warning: unused variable 'check' [-Wunused-variable]
encrypt.c:   360 |         unsigned char check = 0;
encrypt.c:       |                       ^~~~~
encrypt.c: 4 warnings generated.

Number of similar (implementation,compiler) pairs: 4, namely:
ImplementationCompiler
T:avx2clang -march=native -O2 -fwrapv -Qunused-arguments -fPIC -fPIE -gdwarf-4 -Wall (Ubuntu_Clang_21.1.8_(6ubuntu1))
T:avx2clang -march=native -O3 -fwrapv -Qunused-arguments -fPIC -fPIE -gdwarf-4 -Wall (Ubuntu_Clang_21.1.8_(6ubuntu1))
T:avx2clang -march=native -O -fwrapv -Qunused-arguments -fPIC -fPIE -gdwarf-4 -Wall (Ubuntu_Clang_21.1.8_(6ubuntu1))
T:avx2clang -march=native -Os -fwrapv -Qunused-arguments -fPIC -fPIE -gdwarf-4 -Wall (Ubuntu_Clang_21.1.8_(6ubuntu1))

Compiler output


encrypt.c: encrypt.c: In function 'crypto_aead_morus1280128v2_avx2_timingleaks_encrypt':
encrypt.c: encrypt.c:309:31: warning: unused variable 'j' [-Wunused-variable]
encrypt.c:   309 |         unsigned long long i, j;
encrypt.c:       |                               ^
encrypt.c: encrypt.c: In function 'crypto_aead_morus1280128v2_avx2_timingleaks_decrypt':
encrypt.c: encrypt.c:360:23: warning: unused variable 'check' [-Wunused-variable]
encrypt.c:   360 |         unsigned char check = 0;
encrypt.c:       |                       ^~~~~
encrypt.c: encrypt.c:359:23: warning: unused variable 'tag' [-Wunused-variable]
encrypt.c:   359 |         unsigned char tag[16];
encrypt.c:       |                       ^~~
encrypt.c: encrypt.c:357:31: warning: unused variable 'j' [-Wunused-variable]
encrypt.c:   357 |         unsigned long long i, j;
encrypt.c:       |                               ^

Number of similar (implementation,compiler) pairs: 3, namely:
ImplementationCompiler
T:avx2gcc -march=native -mtune=native -O2 -fwrapv -fPIC -fPIE -gdwarf-4 -Wall (15.2.0)
T:avx2gcc -march=native -mtune=native -O3 -fwrapv -fPIC -fPIE -gdwarf-4 -Wall (15.2.0)
T:avx2gcc -march=native -mtune=native -O -fwrapv -fPIC -fPIE -gdwarf-4 -Wall (15.2.0)

Compiler output


encrypt.c: encrypt.c: In function 'crypto_aead_morus1280128v2_avx2_timingleaks_encrypt':
encrypt.c: encrypt.c:309:31: warning: unused variable 'j' [-Wunused-variable]
encrypt.c:   309 |         unsigned long long i, j;
encrypt.c:       |                               ^
encrypt.c: encrypt.c: In function 'crypto_aead_morus1280128v2_avx2_timingleaks_decrypt':
encrypt.c: encrypt.c:360:23: warning: unused variable 'check' [-Wunused-variable]
encrypt.c:   360 |         unsigned char check = 0;
encrypt.c:       |                       ^~~~~
encrypt.c: encrypt.c:359:23: warning: unused variable 'tag' [-Wunused-variable]
encrypt.c:   359 |         unsigned char tag[16];
encrypt.c:       |                       ^~~
encrypt.c: encrypt.c:357:31: warning: unused variable 'j' [-Wunused-variable]
encrypt.c:   357 |         unsigned long long i, j;
encrypt.c:       |                               ^
try.c: /usr/bin/x86_64-linux-gnu-ld.bfd: libcrypto_aead_morus1280128v2.a(encrypt.o): in function `crypto_aead_morus1280128v2_avx2_timingleaks_encrypt':
try.c: .../supercop-data/hertz/amd64/try/c/gcc_-march=native_-mtune=native_-Os_-fwrapv_-fPIC_-fPIE_-gdwarf-4_-Wall/timingleaks/crypto_aead/morus1280128v2/avx2/work/encrypt.c:320:(.text+0x...): undefined reference to `morus_enc_aut_step'
try.c: /usr/bin/x86_64-linux-gnu-ld.bfd: .../supercop-data/hertz/amd64/try/c/gcc_-march=native_-mtune=native_-Os_-fwrapv_-fPIC_-fPIE_-gdwarf-4_-Wall/timingleaks/crypto_aead/morus1280128v2/avx2/work/encrypt.c:332:(.text+0x...): undefined reference to `morus_enc_aut_step'
try.c: /usr/bin/x86_64-linux-gnu-ld.bfd: libcrypto_aead_morus1280128v2.a(encrypt.o): in function `crypto_aead_morus1280128v2_avx2_timingleaks_decrypt':
try.c: .../supercop-data/hertz/amd64/try/c/gcc_-march=native_-mtune=native_-Os_-fwrapv_-fPIC_-fPIE_-gdwarf-4_-Wall/timingleaks/crypto_aead/morus1280128v2/avx2/work/encrypt.c:367:(.text+0x...): undefined reference to `morus_enc_aut_step'
try.c: /usr/bin/x86_64-linux-gnu-ld.bfd: .../supercop-data/hertz/amd64/try/c/gcc_-march=native_-mtune=native_-Os_-fwrapv_-fPIC_-fPIE_-gdwarf-4_-Wall/timingleaks/crypto_aead/morus1280128v2/avx2/work/encrypt.c:379:(.text+0x...): undefined reference to `morus_dec_aut_step'
try.c: collect2: error: ld returned 1 exit status

Number of similar (implementation,compiler) pairs: 1, namely:
ImplementationCompiler
T:avx2gcc -march=native -mtune=native -Os -fwrapv -fPIC -fPIE -gdwarf-4 -Wall (15.2.0)

Compiler output


encrypt.c: encrypt.c:370:10: warning: unused variable 'check' [-Wunused-variable]
encrypt.c:   370 |         uint8_t check = 0;
encrypt.c:       |                 ^~~~~
encrypt.c: 1 warning generated.

Number of similar (implementation,compiler) pairs: 4, namely:
ImplementationCompiler
T:refclang -march=native -O2 -fwrapv -Qunused-arguments -fPIC -fPIE -gdwarf-4 -Wall (Ubuntu_Clang_21.1.8_(6ubuntu1))
T:refclang -march=native -O3 -fwrapv -Qunused-arguments -fPIC -fPIE -gdwarf-4 -Wall (Ubuntu_Clang_21.1.8_(6ubuntu1))
T:refclang -march=native -O -fwrapv -Qunused-arguments -fPIC -fPIE -gdwarf-4 -Wall (Ubuntu_Clang_21.1.8_(6ubuntu1))
T:refclang -march=native -Os -fwrapv -Qunused-arguments -fPIC -fPIE -gdwarf-4 -Wall (Ubuntu_Clang_21.1.8_(6ubuntu1))

Compiler output


encrypt.c: encrypt.c: In function 'crypto_aead_morus1280128v2_ref_timingleaks_decrypt':
encrypt.c: encrypt.c:370:17: warning: unused variable 'check' [-Wunused-variable]
encrypt.c:   370 |         uint8_t check = 0;
encrypt.c:       |                 ^~~~~

Number of similar (implementation,compiler) pairs: 4, namely:
ImplementationCompiler
T:refgcc -march=native -mtune=native -O2 -fwrapv -fPIC -fPIE -gdwarf-4 -Wall (15.2.0)
T:refgcc -march=native -mtune=native -O3 -fwrapv -fPIC -fPIE -gdwarf-4 -Wall (15.2.0)
T:refgcc -march=native -mtune=native -O -fwrapv -fPIC -fPIE -gdwarf-4 -Wall (15.2.0)
T:refgcc -march=native -mtune=native -Os -fwrapv -fPIC -fPIE -gdwarf-4 -Wall (15.2.0)

Compiler output


encrypt.c: encrypt.c:318:10: warning: unused variable 'check' [-Wunused-variable]
encrypt.c:   318 |         uint8_t check = 0;
encrypt.c:       |                 ^~~~~
encrypt.c: 1 warning generated.

Number of similar (implementation,compiler) pairs: 4, namely:
ImplementationCompiler
T:ref64clang -march=native -O2 -fwrapv -Qunused-arguments -fPIC -fPIE -gdwarf-4 -Wall (Ubuntu_Clang_21.1.8_(6ubuntu1))
T:ref64clang -march=native -O3 -fwrapv -Qunused-arguments -fPIC -fPIE -gdwarf-4 -Wall (Ubuntu_Clang_21.1.8_(6ubuntu1))
T:ref64clang -march=native -O -fwrapv -Qunused-arguments -fPIC -fPIE -gdwarf-4 -Wall (Ubuntu_Clang_21.1.8_(6ubuntu1))
T:ref64clang -march=native -Os -fwrapv -Qunused-arguments -fPIC -fPIE -gdwarf-4 -Wall (Ubuntu_Clang_21.1.8_(6ubuntu1))

Compiler output


encrypt.c: encrypt.c: In function 'crypto_aead_morus1280128v2_ref64_timingleaks_decrypt':
encrypt.c: encrypt.c:318:17: warning: unused variable 'check' [-Wunused-variable]
encrypt.c:   318 |         uint8_t check = 0;
encrypt.c:       |                 ^~~~~

Number of similar (implementation,compiler) pairs: 4, namely:
ImplementationCompiler
T:ref64gcc -march=native -mtune=native -O2 -fwrapv -fPIC -fPIE -gdwarf-4 -Wall (15.2.0)
T:ref64gcc -march=native -mtune=native -O3 -fwrapv -fPIC -fPIE -gdwarf-4 -Wall (15.2.0)
T:ref64gcc -march=native -mtune=native -O -fwrapv -fPIC -fPIE -gdwarf-4 -Wall (15.2.0)
T:ref64gcc -march=native -mtune=native -Os -fwrapv -fPIC -fPIE -gdwarf-4 -Wall (15.2.0)

Compiler output


encrypt.c: encrypt.c:366:10: warning: unused variable 'check' [-Wunused-variable]
encrypt.c:   366 |         uint8_t check = 0;
encrypt.c:       |                 ^~~~~
encrypt.c: 1 warning generated.

Number of similar (implementation,compiler) pairs: 4, namely:
ImplementationCompiler
T:sse2clang -march=native -O2 -fwrapv -Qunused-arguments -fPIC -fPIE -gdwarf-4 -Wall (Ubuntu_Clang_21.1.8_(6ubuntu1))
T:sse2clang -march=native -O3 -fwrapv -Qunused-arguments -fPIC -fPIE -gdwarf-4 -Wall (Ubuntu_Clang_21.1.8_(6ubuntu1))
T:sse2clang -march=native -O -fwrapv -Qunused-arguments -fPIC -fPIE -gdwarf-4 -Wall (Ubuntu_Clang_21.1.8_(6ubuntu1))
T:sse2clang -march=native -Os -fwrapv -Qunused-arguments -fPIC -fPIE -gdwarf-4 -Wall (Ubuntu_Clang_21.1.8_(6ubuntu1))

Compiler output


encrypt.c: encrypt.c: In function 'crypto_aead_morus1280128v2_sse2_timingleaks_decrypt':
encrypt.c: encrypt.c:366:17: warning: unused variable 'check' [-Wunused-variable]
encrypt.c:   366 |         uint8_t check = 0;
encrypt.c:       |                 ^~~~~
try.c: /usr/bin/x86_64-linux-gnu-ld.bfd: libcrypto_aead_morus1280128v2.a(encrypt.o): in function `morus_initialization':
try.c: .../supercop-data/hertz/amd64/try/c/gcc_-march=native_-mtune=native_-O2_-fwrapv_-fPIC_-fPIE_-gdwarf-4_-Wall/timingleaks/crypto_aead/morus1280128v2/sse2/work/encrypt.c:98:(.text+0x...): undefined reference to `morus_stateupdate'
try.c: /usr/bin/x86_64-linux-gnu-ld.bfd: libcrypto_aead_morus1280128v2.a(encrypt.o): in function `morus_initialization_key_256':
try.c: .../supercop-data/hertz/amd64/try/c/gcc_-march=native_-mtune=native_-O2_-fwrapv_-fPIC_-fPIE_-gdwarf-4_-Wall/timingleaks/crypto_aead/morus1280128v2/sse2/work/encrypt.c:118:(.text+0x...): undefined reference to `morus_stateupdate'
try.c: /usr/bin/x86_64-linux-gnu-ld.bfd: libcrypto_aead_morus1280128v2.a(encrypt.o): in function `morus_tag_generation':
try.c: .../supercop-data/hertz/amd64/try/c/gcc_-march=native_-mtune=native_-O2_-fwrapv_-fPIC_-fPIE_-gdwarf-4_-Wall/timingleaks/crypto_aead/morus1280128v2/sse2/work/encrypt.c:141:(.text+0x...): undefined reference to `morus_stateupdate'
try.c: /usr/bin/x86_64-linux-gnu-ld.bfd: libcrypto_aead_morus1280128v2.a(encrypt.o): in function `morus_tag_verification':
try.c: .../supercop-data/hertz/amd64/try/c/gcc_-march=native_-mtune=native_-O2_-fwrapv_-fPIC_-fPIE_-gdwarf-4_-Wall/timingleaks/crypto_aead/morus1280128v2/sse2/work/encrypt.c:176:(.text+0x...): undefined reference to `morus_stateupdate'
try.c: /usr/bin/x86_64-linux-gnu-ld.bfd: libcrypto_aead_morus1280128v2.a(encrypt.o): in function `morus_enc_aut_partialblock':
try.c: .../supercop-data/hertz/amd64/try/c/gcc_-march=native_-mtune=native_-O2_-fwrapv_-fPIC_-fPIE_-gdwarf-4_-Wall/timingleaks/crypto_aead/morus1280128v2/sse2/work/encrypt.c:271:(.text+0x...): undefined reference to `morus_stateupdate'
try.c: /usr/bin/x86_64-linux-gnu-ld.bfd: libcrypto_aead_morus1280128v2.a(encrypt.o):.../supercop-data/hertz/amd64/try/c/gcc_-march=native_-mtune=native_-O2_-fwrapv_-fPIC_-fPIE_-gdwarf-4_-Wall/timingleaks/crypto_aead/morus1280128v2/sse2/work/encrypt.c:303: more undefined references to `morus_stateupdate' follow
try.c: collect2: error: ld returned 1 exit status

Number of similar (implementation,compiler) pairs: 1, namely:
ImplementationCompiler
T:sse2gcc -march=native -mtune=native -O2 -fwrapv -fPIC -fPIE -gdwarf-4 -Wall (15.2.0)

Compiler output


encrypt.c: encrypt.c: In function 'crypto_aead_morus1280128v2_sse2_timingleaks_decrypt':
encrypt.c: encrypt.c:366:17: warning: unused variable 'check' [-Wunused-variable]
encrypt.c:   366 |         uint8_t check = 0;
encrypt.c:       |                 ^~~~~

Number of similar (implementation,compiler) pairs: 1, namely:
ImplementationCompiler
T:sse2gcc -march=native -mtune=native -O3 -fwrapv -fPIC -fPIE -gdwarf-4 -Wall (15.2.0)

Compiler output


encrypt.c: encrypt.c: In function 'crypto_aead_morus1280128v2_sse2_timingleaks_decrypt':
encrypt.c: encrypt.c:366:17: warning: unused variable 'check' [-Wunused-variable]
encrypt.c:   366 |         uint8_t check = 0;
encrypt.c:       |                 ^~~~~
try.c: /usr/bin/x86_64-linux-gnu-ld.bfd: libcrypto_aead_morus1280128v2.a(encrypt.o): in function `morus_initialization':
try.c: .../supercop-data/hertz/amd64/try/c/gcc_-march=native_-mtune=native_-O_-fwrapv_-fPIC_-fPIE_-gdwarf-4_-Wall/timingleaks/crypto_aead/morus1280128v2/sse2/work/encrypt.c:98:(.text+0x...): undefined reference to `morus_stateupdate'
try.c: /usr/bin/x86_64-linux-gnu-ld.bfd: libcrypto_aead_morus1280128v2.a(encrypt.o): in function `morus_initialization_key_256':
try.c: .../supercop-data/hertz/amd64/try/c/gcc_-march=native_-mtune=native_-O_-fwrapv_-fPIC_-fPIE_-gdwarf-4_-Wall/timingleaks/crypto_aead/morus1280128v2/sse2/work/encrypt.c:118:(.text+0x...): undefined reference to `morus_stateupdate'
try.c: /usr/bin/x86_64-linux-gnu-ld.bfd: libcrypto_aead_morus1280128v2.a(encrypt.o): in function `morus_tag_generation':
try.c: .../supercop-data/hertz/amd64/try/c/gcc_-march=native_-mtune=native_-O_-fwrapv_-fPIC_-fPIE_-gdwarf-4_-Wall/timingleaks/crypto_aead/morus1280128v2/sse2/work/encrypt.c:141:(.text+0x...): undefined reference to `morus_stateupdate'
try.c: /usr/bin/x86_64-linux-gnu-ld.bfd: libcrypto_aead_morus1280128v2.a(encrypt.o): in function `morus_tag_verification':
try.c: .../supercop-data/hertz/amd64/try/c/gcc_-march=native_-mtune=native_-O_-fwrapv_-fPIC_-fPIE_-gdwarf-4_-Wall/timingleaks/crypto_aead/morus1280128v2/sse2/work/encrypt.c:176:(.text+0x...): undefined reference to `morus_stateupdate'
try.c: /usr/bin/x86_64-linux-gnu-ld.bfd: libcrypto_aead_morus1280128v2.a(encrypt.o): in function `morus_enc_aut_partialblock':
try.c: .../supercop-data/hertz/amd64/try/c/gcc_-march=native_-mtune=native_-O_-fwrapv_-fPIC_-fPIE_-gdwarf-4_-Wall/timingleaks/crypto_aead/morus1280128v2/sse2/work/encrypt.c:271:(.text+0x...): undefined reference to `morus_stateupdate'
try.c: /usr/bin/x86_64-linux-gnu-ld.bfd: libcrypto_aead_morus1280128v2.a(encrypt.o):.../supercop-data/hertz/amd64/try/c/gcc_-march=native_-mtune=native_-O_-fwrapv_-fPIC_-fPIE_-gdwarf-4_-Wall/timingleaks/crypto_aead/morus1280128v2/sse2/work/encrypt.c:303: more undefined references to `morus_stateupdate' follow
try.c: collect2: error: ld returned 1 exit status

Number of similar (implementation,compiler) pairs: 1, namely:
ImplementationCompiler
T:sse2gcc -march=native -mtune=native -O -fwrapv -fPIC -fPIE -gdwarf-4 -Wall (15.2.0)

Compiler output


encrypt.c: encrypt.c: In function 'crypto_aead_morus1280128v2_sse2_timingleaks_decrypt':
encrypt.c: encrypt.c:366:17: warning: unused variable 'check' [-Wunused-variable]
encrypt.c:   366 |         uint8_t check = 0;
encrypt.c:       |                 ^~~~~
try.c: /usr/bin/x86_64-linux-gnu-ld.bfd: libcrypto_aead_morus1280128v2.a(encrypt.o): in function `morus_initialization':
try.c: .../supercop-data/hertz/amd64/try/c/gcc_-march=native_-mtune=native_-Os_-fwrapv_-fPIC_-fPIE_-gdwarf-4_-Wall/timingleaks/crypto_aead/morus1280128v2/sse2/work/encrypt.c:98:(.text+0x...): undefined reference to `morus_stateupdate'
try.c: /usr/bin/x86_64-linux-gnu-ld.bfd: libcrypto_aead_morus1280128v2.a(encrypt.o): in function `morus_initialization_key_256':
try.c: .../supercop-data/hertz/amd64/try/c/gcc_-march=native_-mtune=native_-Os_-fwrapv_-fPIC_-fPIE_-gdwarf-4_-Wall/timingleaks/crypto_aead/morus1280128v2/sse2/work/encrypt.c:118:(.text+0x...): undefined reference to `morus_stateupdate'
try.c: /usr/bin/x86_64-linux-gnu-ld.bfd: libcrypto_aead_morus1280128v2.a(encrypt.o): in function `morus_tag_generation':
try.c: .../supercop-data/hertz/amd64/try/c/gcc_-march=native_-mtune=native_-Os_-fwrapv_-fPIC_-fPIE_-gdwarf-4_-Wall/timingleaks/crypto_aead/morus1280128v2/sse2/work/encrypt.c:141:(.text+0x...): undefined reference to `morus_stateupdate'
try.c: /usr/bin/x86_64-linux-gnu-ld.bfd: libcrypto_aead_morus1280128v2.a(encrypt.o): in function `morus_tag_verification':
try.c: .../supercop-data/hertz/amd64/try/c/gcc_-march=native_-mtune=native_-Os_-fwrapv_-fPIC_-fPIE_-gdwarf-4_-Wall/timingleaks/crypto_aead/morus1280128v2/sse2/work/encrypt.c:176:(.text+0x...): undefined reference to `morus_stateupdate'
try.c: /usr/bin/x86_64-linux-gnu-ld.bfd: libcrypto_aead_morus1280128v2.a(encrypt.o): in function `morus_enc_aut_partialblock':
try.c: .../supercop-data/hertz/amd64/try/c/gcc_-march=native_-mtune=native_-Os_-fwrapv_-fPIC_-fPIE_-gdwarf-4_-Wall/timingleaks/crypto_aead/morus1280128v2/sse2/work/encrypt.c:271:(.text+0x...): undefined reference to `morus_stateupdate'
try.c: /usr/bin/x86_64-linux-gnu-ld.bfd: libcrypto_aead_morus1280128v2.a(encrypt.o):.../supercop-data/hertz/amd64/try/c/gcc_-march=native_-mtune=native_-Os_-fwrapv_-fPIC_-fPIE_-gdwarf-4_-Wall/timingleaks/crypto_aead/morus1280128v2/sse2/work/encrypt.c:303: more undefined references to `morus_stateupdate' follow
try.c: /usr/bin/x86_64-linux-gnu-ld.bfd: libcrypto_aead_morus1280128v2.a(encrypt.o): in function `crypto_aead_morus1280128v2_sse2_timingleaks_encrypt':
try.c: .../supercop-data/hertz/amd64/try/c/gcc_-march=native_-mtune=native_-Os_-fwrapv_-fPIC_-fPIE_-gdwarf-4_-Wall/timingleaks/crypto_aead/morus1280128v2/sse2/work/encrypt.c:328:(.text+0x...): undefined reference to `morus_enc_aut_step'
try.c: /usr/bin/x86_64-linux-gnu-ld.bfd: .../supercop-data/hertz/amd64/try/c/gcc_-march=native_-mtune=native_-Os_-fwrapv_-fPIC_-fPIE_-gdwarf-4_-Wall/timingleaks/crypto_aead/morus1280128v2/sse2/work/encrypt.c:339:(.text+0x...): undefined reference to `morus_enc_aut_step'
try.c: /usr/bin/x86_64-linux-gnu-ld.bfd: libcrypto_aead_morus1280128v2.a(encrypt.o): in function `crypto_aead_morus1280128v2_sse2_timingleaks_decrypt':
try.c: .../supercop-data/hertz/amd64/try/c/gcc_-march=native_-mtune=native_-Os_-fwrapv_-fPIC_-fPIE_-gdwarf-4_-Wall/timingleaks/crypto_aead/morus1280128v2/sse2/work/encrypt.c:373:(.text+0x...): undefined reference to `morus_enc_aut_step'
try.c: /usr/bin/x86_64-linux-gnu-ld.bfd: .../supercop-data/hertz/amd64/try/c/gcc_-march=native_-mtune=native_-Os_-fwrapv_-fPIC_-fPIE_-gdwarf-4_-Wall/timingleaks/crypto_aead/morus1280128v2/sse2/work/encrypt.c:385:(.text+0x...): undefined reference to `morus_dec_aut_step'
try.c: collect2: error: ld returned 1 exit status

Number of similar (implementation,compiler) pairs: 1, namely:
ImplementationCompiler
T:sse2gcc -march=native -mtune=native -Os -fwrapv -fPIC -fPIE -gdwarf-4 -Wall (15.2.0)

Namespace violations


encrypt.o morus_dec_aut_partialblock T
encrypt.o morus_enc_aut_partialblock T
encrypt.o morus_initialization T
encrypt.o morus_stateupdate T
encrypt.o morus_tag_generation T
encrypt.o morus_tag_verification T

Number of similar (implementation,compiler) pairs: 7, namely:
ImplementationCompiler
T:avx2clang -march=native -O2 -fwrapv -Qunused-arguments -fPIC -fPIE -gdwarf-4 -Wall (Ubuntu_Clang_21.1.8_(6ubuntu1))
T:avx2clang -march=native -O3 -fwrapv -Qunused-arguments -fPIC -fPIE -gdwarf-4 -Wall (Ubuntu_Clang_21.1.8_(6ubuntu1))
T:avx2clang -march=native -O -fwrapv -Qunused-arguments -fPIC -fPIE -gdwarf-4 -Wall (Ubuntu_Clang_21.1.8_(6ubuntu1))
T:avx2clang -march=native -Os -fwrapv -Qunused-arguments -fPIC -fPIE -gdwarf-4 -Wall (Ubuntu_Clang_21.1.8_(6ubuntu1))
T:avx2gcc -march=native -mtune=native -O2 -fwrapv -fPIC -fPIE -gdwarf-4 -Wall (15.2.0)
T:avx2gcc -march=native -mtune=native -O3 -fwrapv -fPIC -fPIE -gdwarf-4 -Wall (15.2.0)
T:avx2gcc -march=native -mtune=native -O -fwrapv -fPIC -fPIE -gdwarf-4 -Wall (15.2.0)

Namespace violations


encrypt.o morus_dec_aut_partialblock T
encrypt.o morus_dec_aut_step T
encrypt.o morus_enc_aut_partialblock T
encrypt.o morus_enc_aut_step T
encrypt.o morus_initialization T
encrypt.o morus_stateupdate T
encrypt.o morus_tag_generation T
encrypt.o morus_tag_verification T

Number of similar (implementation,compiler) pairs: 16, namely:
ImplementationCompiler
T:refclang -march=native -O2 -fwrapv -Qunused-arguments -fPIC -fPIE -gdwarf-4 -Wall (Ubuntu_Clang_21.1.8_(6ubuntu1))
T:refclang -march=native -O3 -fwrapv -Qunused-arguments -fPIC -fPIE -gdwarf-4 -Wall (Ubuntu_Clang_21.1.8_(6ubuntu1))
T:refclang -march=native -O -fwrapv -Qunused-arguments -fPIC -fPIE -gdwarf-4 -Wall (Ubuntu_Clang_21.1.8_(6ubuntu1))
T:refclang -march=native -Os -fwrapv -Qunused-arguments -fPIC -fPIE -gdwarf-4 -Wall (Ubuntu_Clang_21.1.8_(6ubuntu1))
T:refgcc -march=native -mtune=native -O2 -fwrapv -fPIC -fPIE -gdwarf-4 -Wall (15.2.0)
T:refgcc -march=native -mtune=native -O3 -fwrapv -fPIC -fPIE -gdwarf-4 -Wall (15.2.0)
T:refgcc -march=native -mtune=native -O -fwrapv -fPIC -fPIE -gdwarf-4 -Wall (15.2.0)
T:refgcc -march=native -mtune=native -Os -fwrapv -fPIC -fPIE -gdwarf-4 -Wall (15.2.0)
T:ref64clang -march=native -O2 -fwrapv -Qunused-arguments -fPIC -fPIE -gdwarf-4 -Wall (Ubuntu_Clang_21.1.8_(6ubuntu1))
T:ref64clang -march=native -O3 -fwrapv -Qunused-arguments -fPIC -fPIE -gdwarf-4 -Wall (Ubuntu_Clang_21.1.8_(6ubuntu1))
T:ref64clang -march=native -O -fwrapv -Qunused-arguments -fPIC -fPIE -gdwarf-4 -Wall (Ubuntu_Clang_21.1.8_(6ubuntu1))
T:ref64clang -march=native -Os -fwrapv -Qunused-arguments -fPIC -fPIE -gdwarf-4 -Wall (Ubuntu_Clang_21.1.8_(6ubuntu1))
T:ref64gcc -march=native -mtune=native -O2 -fwrapv -fPIC -fPIE -gdwarf-4 -Wall (15.2.0)
T:ref64gcc -march=native -mtune=native -O3 -fwrapv -fPIC -fPIE -gdwarf-4 -Wall (15.2.0)
T:ref64gcc -march=native -mtune=native -O -fwrapv -fPIC -fPIE -gdwarf-4 -Wall (15.2.0)
T:ref64gcc -march=native -mtune=native -Os -fwrapv -fPIC -fPIE -gdwarf-4 -Wall (15.2.0)

Namespace violations


encrypt.o morus_dec_aut_partialblock T
encrypt.o morus_enc_aut_partialblock T
encrypt.o morus_initialization T
encrypt.o morus_initialization_key_256 T
encrypt.o morus_tag_generation T
encrypt.o morus_tag_verification T

Number of similar (implementation,compiler) pairs: 5, namely:
ImplementationCompiler
T:sse2clang -march=native -O2 -fwrapv -Qunused-arguments -fPIC -fPIE -gdwarf-4 -Wall (Ubuntu_Clang_21.1.8_(6ubuntu1))
T:sse2clang -march=native -O3 -fwrapv -Qunused-arguments -fPIC -fPIE -gdwarf-4 -Wall (Ubuntu_Clang_21.1.8_(6ubuntu1))
T:sse2clang -march=native -O -fwrapv -Qunused-arguments -fPIC -fPIE -gdwarf-4 -Wall (Ubuntu_Clang_21.1.8_(6ubuntu1))
T:sse2clang -march=native -Os -fwrapv -Qunused-arguments -fPIC -fPIE -gdwarf-4 -Wall (Ubuntu_Clang_21.1.8_(6ubuntu1))
T:sse2gcc -march=native -mtune=native -O3 -fwrapv -fPIC -fPIE -gdwarf-4 -Wall (15.2.0)