Test results for amd64, hertz, crypto_aead/ascon128av12

[Page version: 20261007 20:07:58]

Measurements for amd64, hertz, crypto_aead Test results for amd64, hertz, crypto_aead Test results for crypto_aead/ascon128av12
Computer: hertz
Microarchitecture: amd64; Zen 4 (a60f12)
Architecture: amd64
CPU ID: AuthenticAMD-00a60f12-178bfbff
SUPERCOP version: 20261004
Operation: crypto_aead
Primitive: ascon128av12
TimeObject sizeTest sizeImplementationCompilerBenchmark dateSUPERCOP version
3319616795 0 050315 1288 1696opt64clang -march=native -O3 -fwrapv -Qunused-arguments -fPIC -fPIE -gdwarf-4 -Wall2026100620261004
3320216742 0 048843 1288 1696opt64clang -march=native -O2 -fwrapv -Qunused-arguments -fPIC -fPIE -gdwarf-4 -Wall2026100620261004
3320816708 0 042997 1280 1696opt64clang -march=native -Os -fwrapv -Qunused-arguments -fPIC -fPIE -gdwarf-4 -Wall2026100620261004
3624816837 0 042331 1288 1632opt64clang -march=native -O -fwrapv -Qunused-arguments -fPIC -fPIE -gdwarf-4 -Wall2026100620261004
3689020419 0 051214 1256 1792refgcc -march=native -mtune=native -O3 -fwrapv -fPIC -fPIE -gdwarf-4 -Wall2026100620261004
3691617860 0 044926 1256 1792opt64gcc -march=native -mtune=native -O2 -fwrapv -fPIC -fPIE -gdwarf-4 -Wall2026100620261004
3763917812 0 048542 1256 1792opt64gcc -march=native -mtune=native -O3 -fwrapv -fPIC -fPIE -gdwarf-4 -Wall2026100620261004
4644811902 0 045043 1288 1696refclang -march=native -O3 -fwrapv -Qunused-arguments -fPIC -fPIE -gdwarf-4 -Wall2026100620261004
4687411854 0 043635 1288 1696refclang -march=native -O2 -fwrapv -Qunused-arguments -fPIC -fPIE -gdwarf-4 -Wall2026100620261004
4754113351 0 040534 1256 1792refgcc -march=native -mtune=native -O2 -fwrapv -fPIC -fPIE -gdwarf-4 -Wall2026100620261004
4781623286 0 054046 1256 1792opt32gcc -march=native -mtune=native -O3 -fwrapv -fPIC -fPIE -gdwarf-4 -Wall2026100620261004
4785023318 0 050430 1256 1792opt32gcc -march=native -mtune=native -O2 -fwrapv -fPIC -fPIE -gdwarf-4 -Wall2026100620261004
478551477 0 026947 1288 1632opt64_lowsizeclang -march=native -O -fwrapv -Qunused-arguments -fPIC -fPIE -gdwarf-4 -Wall2026100620261004
478661922 0 033995 1288 1696opt64_lowsizeclang -march=native -O2 -fwrapv -Qunused-arguments -fPIC -fPIE -gdwarf-4 -Wall2026100620261004
4788521892 0 048733 1248 1728opt64gcc -march=native -mtune=native -O -fwrapv -fPIC -fPIE -gdwarf-4 -Wall2026100620261004
480352185 0 035723 1288 1696opt64_lowsizeclang -march=native -O3 -fwrapv -Qunused-arguments -fPIC -fPIE -gdwarf-4 -Wall2026100620261004
484872271 0 032910 1256 1792opt64_lowsizegcc -march=native -mtune=native -O3 -fwrapv -fPIC -fPIE -gdwarf-4 -Wall2026100620261004
4854513523 0 040485 1248 1728refgcc -march=native -mtune=native -O -fwrapv -fPIC -fPIE -gdwarf-4 -Wall2026100620261004
4856710230 0 036445 1280 1696refclang -march=native -Os -fwrapv -Qunused-arguments -fPIC -fPIE -gdwarf-4 -Wall2026100620261004
496611493 0 027757 1280 1696opt64_lowsizeclang -march=native -Os -fwrapv -Qunused-arguments -fPIC -fPIE -gdwarf-4 -Wall2026100620261004
503191791 0 026937 1232 1696opt64_lowsizegcc -march=native -mtune=native -Os -fwrapv -fPIC -fPIE -gdwarf-4 -Wall2026100620261004
514743204 0 029989 1248 1728opt64_lowsizegcc -march=native -mtune=native -O -fwrapv -fPIC -fPIE -gdwarf-4 -Wall2026100620261004
5155925604 0 050817 1232 1696opt64gcc -march=native -mtune=native -Os -fwrapv -fPIC -fPIE -gdwarf-4 -Wall2026100620261004
5165631401 0 056633 1232 1696opt32gcc -march=native -mtune=native -Os -fwrapv -fPIC -fPIE -gdwarf-4 -Wall2026100620261004
516716616 0 032131 1288 1632refclang -march=native -O -fwrapv -Qunused-arguments -fPIC -fPIE -gdwarf-4 -Wall2026100620261004
519102111 0 029166 1256 1792opt64_lowsizegcc -march=native -mtune=native -O2 -fwrapv -fPIC -fPIE -gdwarf-4 -Wall2026100620261004
5195320772 0 046235 1288 1632opt32clang -march=native -O -fwrapv -Qunused-arguments -fPIC -fPIE -gdwarf-4 -Wall2026100620261004
527532169 0 029238 1256 1792opt32_lowsizegcc -march=native -mtune=native -O2 -fwrapv -fPIC -fPIE -gdwarf-4 -Wall2026100620261004
531632329 0 032982 1256 1792opt32_lowsizegcc -march=native -mtune=native -O3 -fwrapv -fPIC -fPIE -gdwarf-4 -Wall2026100620261004
5592527217 0 054045 1248 1728opt32gcc -march=native -mtune=native -O -fwrapv -fPIC -fPIE -gdwarf-4 -Wall2026100620261004
576731919 0 027049 1232 1696opt32_lowsizegcc -march=native -mtune=native -Os -fwrapv -fPIC -fPIE -gdwarf-4 -Wall2026100620261004
585421516 0 026947 1288 1632opt32_lowsizeclang -march=native -O -fwrapv -Qunused-arguments -fPIC -fPIE -gdwarf-4 -Wall2026100620261004
628033262 0 030053 1248 1728opt32_lowsizegcc -march=native -mtune=native -O -fwrapv -fPIC -fPIE -gdwarf-4 -Wall2026100620261004
679983211 0 028497 1232 1696refgcc -march=native -mtune=native -Os -fwrapv -fPIC -fPIE -gdwarf-4 -Wall2026100620261004
7003421557 0 047669 1280 1696opt32clang -march=native -Os -fwrapv -Qunused-arguments -fPIC -fPIE -gdwarf-4 -Wall2026100620261004
7013221609 0 054987 1288 1696opt32clang -march=native -O3 -fwrapv -Qunused-arguments -fPIC -fPIE -gdwarf-4 -Wall2026100620261004
7017121581 0 053579 1288 1696opt32clang -march=native -O2 -fwrapv -Qunused-arguments -fPIC -fPIE -gdwarf-4 -Wall2026100620261004
867412074 0 034179 1288 1696opt32_lowsizeclang -march=native -O2 -fwrapv -Qunused-arguments -fPIC -fPIE -gdwarf-4 -Wall2026100620261004
868362337 0 035843 1288 1696opt32_lowsizeclang -march=native -O3 -fwrapv -Qunused-arguments -fPIC -fPIE -gdwarf-4 -Wall2026100620261004
873271630 0 027821 1280 1696opt32_lowsizeclang -march=native -Os -fwrapv -Qunused-arguments -fPIC -fPIE -gdwarf-4 -Wall2026100620261004
10393515115 0 041349 1280 1696bi32clang -march=native -Os -fwrapv -Qunused-arguments -fPIC -fPIE -gdwarf-4 -Wall2026100620261004
10417915016 0 047131 1288 1696bi32clang -march=native -O2 -fwrapv -Qunused-arguments -fPIC -fPIE -gdwarf-4 -Wall2026100620261004
10419115016 0 048539 1288 1696bi32clang -march=native -O3 -fwrapv -Qunused-arguments -fPIC -fPIE -gdwarf-4 -Wall2026100620261004
10431317236 0 044278 1256 1792bi32gcc -march=native -mtune=native -O2 -fwrapv -fPIC -fPIE -gdwarf-4 -Wall2026100620261004
10461817236 0 047830 1256 1792bi32gcc -march=native -mtune=native -O3 -fwrapv -fPIC -fPIE -gdwarf-4 -Wall2026100620261004
10668816406 0 041521 1232 1696bi32gcc -march=native -mtune=native -Os -fwrapv -fPIC -fPIE -gdwarf-4 -Wall2026100620261004
10867415797 0 041323 1288 1632bi32clang -march=native -O -fwrapv -Qunused-arguments -fPIC -fPIE -gdwarf-4 -Wall2026100620261004
1140762351 0 028605 1280 1696bi32_lowsizeclang -march=native -Os -fwrapv -Qunused-arguments -fPIC -fPIE -gdwarf-4 -Wall2026100620261004
1150202365 0 034435 1288 1696bi32_lowsizeclang -march=native -O2 -fwrapv -Qunused-arguments -fPIC -fPIE -gdwarf-4 -Wall2026100620261004
11506510774 0 037125 1280 1696bi32_lowregclang -march=native -Os -fwrapv -Qunused-arguments -fPIC -fPIE -gdwarf-4 -Wall2026100620261004
1153352615 0 036099 1288 1696bi32_lowsizeclang -march=native -O3 -fwrapv -Qunused-arguments -fPIC -fPIE -gdwarf-4 -Wall2026100620261004
11604320697 0 047445 1248 1728bi32gcc -march=native -mtune=native -O -fwrapv -fPIC -fPIE -gdwarf-4 -Wall2026100620261004
11778610647 0 042819 1288 1696bi32_lowregclang -march=native -O2 -fwrapv -Qunused-arguments -fPIC -fPIE -gdwarf-4 -Wall2026100620261004
11778910647 0 044227 1288 1696bi32_lowregclang -march=native -O3 -fwrapv -Qunused-arguments -fPIC -fPIE -gdwarf-4 -Wall2026100620261004
11813010850 0 036411 1288 1632bi32_lowregclang -march=native -O -fwrapv -Qunused-arguments -fPIC -fPIE -gdwarf-4 -Wall2026100620261004
1197622619 0 027649 1232 1696bi32_lowsizegcc -march=native -mtune=native -Os -fwrapv -fPIC -fPIE -gdwarf-4 -Wall2026100620261004
12093711200 0 041902 1256 1792bi32_lowreggcc -march=native -mtune=native -O3 -fwrapv -fPIC -fPIE -gdwarf-4 -Wall2026100620261004
12111211208 0 038358 1256 1792bi32_lowreggcc -march=native -mtune=native -O2 -fwrapv -fPIC -fPIE -gdwarf-4 -Wall2026100620261004
1224692311 0 027787 1288 1632bi32_lowsizeclang -march=native -O -fwrapv -Qunused-arguments -fPIC -fPIE -gdwarf-4 -Wall2026100620261004
1243613003 0 029942 1256 1792bi32_lowsizegcc -march=native -mtune=native -O2 -fwrapv -fPIC -fPIE -gdwarf-4 -Wall2026100620261004
1255763179 0 033750 1256 1792bi32_lowsizegcc -march=native -mtune=native -O3 -fwrapv -fPIC -fPIE -gdwarf-4 -Wall2026100620261004
12668813855 0 040717 1248 1728bi32_lowreggcc -march=native -mtune=native -O -fwrapv -fPIC -fPIE -gdwarf-4 -Wall2026100620261004
12824010234 0 035409 1232 1696bi32_lowreggcc -march=native -mtune=native -Os -fwrapv -fPIC -fPIE -gdwarf-4 -Wall2026100620261004
1359263157 0 029861 1248 1728bi32_lowsizegcc -march=native -mtune=native -O -fwrapv -fPIC -fPIE -gdwarf-4 -Wall2026100620261004
2198779370 0 036046 1256 1792bi8gcc -march=native -mtune=native -O2 -fwrapv -fPIC -fPIE -gdwarf-4 -Wall2026100620261004
2203739365 0 039598 1256 1792bi8gcc -march=native -mtune=native -O3 -fwrapv -fPIC -fPIE -gdwarf-4 -Wall2026100620261004
3593756431 0 038603 1288 1696opt8clang -march=native -O2 -fwrapv -Qunused-arguments -fPIC -fPIE -gdwarf-4 -Wall2026100620261004
3598076197 0 038339 1288 1696opt8_lowsizeclang -march=native -O2 -fwrapv -Qunused-arguments -fPIC -fPIE -gdwarf-4 -Wall2026100620261004
3763193896 0 030141 1280 1696opt8clang -march=native -Os -fwrapv -Qunused-arguments -fPIC -fPIE -gdwarf-4 -Wall2026100620261004
3770463813 0 030053 1280 1696opt8_lowsizeclang -march=native -Os -fwrapv -Qunused-arguments -fPIC -fPIE -gdwarf-4 -Wall2026100620261004
4019638688 0 034509 1280 1696bi8clang -march=native -Os -fwrapv -Qunused-arguments -fPIC -fPIE -gdwarf-4 -Wall2026100620261004
4021058696 0 040355 1288 1696bi8clang -march=native -O2 -fwrapv -Qunused-arguments -fPIC -fPIE -gdwarf-4 -Wall2026100620261004
4021108707 0 041763 1288 1696bi8clang -march=native -O3 -fwrapv -Qunused-arguments -fPIC -fPIE -gdwarf-4 -Wall2026100620261004
4075837124 0 037830 1256 1792opt8_lowsizegcc -march=native -mtune=native -O3 -fwrapv -fPIC -fPIE -gdwarf-4 -Wall2026100620261004
4080764567 0 031782 1256 1792opt8gcc -march=native -mtune=native -O2 -fwrapv -fPIC -fPIE -gdwarf-4 -Wall2026100620261004
4087586744 0 037542 1256 1792opt8gcc -march=native -mtune=native -O3 -fwrapv -fPIC -fPIE -gdwarf-4 -Wall2026100620261004
4087794400 0 031558 1256 1792opt8_lowsizegcc -march=native -mtune=native -O2 -fwrapv -fPIC -fPIE -gdwarf-4 -Wall2026100620261004
4142629524 0 034683 1288 1632bi8clang -march=native -O -fwrapv -Qunused-arguments -fPIC -fPIE -gdwarf-4 -Wall2026100620261004
5156717156 0 040707 1288 1696opt8_lowsizeclang -march=native -O3 -fwrapv -Qunused-arguments -fPIC -fPIE -gdwarf-4 -Wall2026100620261004
5177687390 0 040971 1288 1696opt8clang -march=native -O3 -fwrapv -Qunused-arguments -fPIC -fPIE -gdwarf-4 -Wall2026100620261004
5514034646 0 030179 1288 1632opt8clang -march=native -O -fwrapv -Qunused-arguments -fPIC -fPIE -gdwarf-4 -Wall2026100620261004
5550814516 0 030027 1288 1632opt8_lowsizeclang -march=native -O -fwrapv -Qunused-arguments -fPIC -fPIE -gdwarf-4 -Wall2026100620261004
62069910040 0 034897 1232 1696bi8gcc -march=native -mtune=native -Os -fwrapv -fPIC -fPIE -gdwarf-4 -Wall2026100620261004
64413915191 0 041581 1248 1728bi8gcc -march=native -mtune=native -O -fwrapv -fPIC -fPIE -gdwarf-4 -Wall2026100620261004
12805276787 0 033613 1248 1728opt8_lowsizegcc -march=native -mtune=native -O -fwrapv -fPIC -fPIE -gdwarf-4 -Wall2026100620261004
12826496897 0 033837 1248 1728opt8gcc -march=native -mtune=native -O -fwrapv -fPIC -fPIE -gdwarf-4 -Wall2026100620261004
16560386219 0 031473 1232 1696opt8gcc -march=native -mtune=native -Os -fwrapv -fPIC -fPIE -gdwarf-4 -Wall2026100620261004
16645886093 0 031281 1232 1696opt8_lowsizegcc -march=native -mtune=native -Os -fwrapv -fPIC -fPIE -gdwarf-4 -Wall2026100620261004

Compiler output


ascon.S: ascon.S:159:5: error: ambiguous instructions require an explicit suffix (could be 'jb', or 'jl')
ascon.S:     j .LPloopcond
ascon.S:     ^
ascon.S: ascon.S:162:5: error: unknown use of instruction mnemonic without a size suffix
ascon.S:     xor s5, s5, t2
ascon.S:     ^
ascon.S: ascon.S:163:15: error: expected register here
ascon.S:     lbu t2, 1(t1)
ascon.S:               ^
ascon.S: ascon.S:164:5: error: unknown use of instruction mnemonic without a size suffix
ascon.S:     xor s4, s4, t2
ascon.S:     ^
ascon.S: <instantiation>:1:1: error: unknown use of instruction mnemonic without a size suffix
ascon.S: xor t3, s1, s9
ascon.S: ^
ascon.S: ascon.S:167:5: note: while in macro instantiation
ascon.S:     sbox s1, s3, s5, s7, s9, t4, t3, t5
ascon.S:     ^
ascon.S: <instantiation>:2:5: error: unknown use of instruction mnemonic without a size suffix
ascon.S:     xor t5, s7, s9
ascon.S:     ^
ascon.S: ascon.S:167:5: note: while in macro instantiation
ascon.S:     sbox s1, s3, s5, s7, s9, t4, t3, t5
ascon.S:     ^
ascon.S: <instantiation>:3:5: error: unknown use of instruction mnemonic without a size suffix
ascon.S: ...

Number of similar (implementation,compiler) pairs: 4, namely:
ImplementationCompiler
T:asm_bi32_rv32bclang -march=native -O2 -fwrapv -Qunused-arguments -fPIC -fPIE -gdwarf-4 -Wall (Ubuntu_Clang_21.1.8_(6ubuntu1))
T:asm_bi32_rv32bclang -march=native -O3 -fwrapv -Qunused-arguments -fPIC -fPIE -gdwarf-4 -Wall (Ubuntu_Clang_21.1.8_(6ubuntu1))
T:asm_bi32_rv32bclang -march=native -O -fwrapv -Qunused-arguments -fPIC -fPIE -gdwarf-4 -Wall (Ubuntu_Clang_21.1.8_(6ubuntu1))
T:asm_bi32_rv32bclang -march=native -Os -fwrapv -Qunused-arguments -fPIC -fPIE -gdwarf-4 -Wall (Ubuntu_Clang_21.1.8_(6ubuntu1))

Compiler output


ascon.S: /tmp/cc1GlXJW.s: Assembler messages:
ascon.S: ascon.S:159: Error: no such instruction: `j .LPloopcond'
ascon.S: ascon.S:162: Error: too many memory references for `xor'
ascon.S: ascon.S:163: Error: no such instruction: `lbu t2,1(t1)'
ascon.S: ascon.S:164: Error: too many memory references for `xor'
ascon.S: ascon.S:73: Error: too many memory references for `xor'
ascon.S: ascon.S:167:  Info: macro invoked from here
ascon.S: ascon.S:74: Error: too many memory references for `xor'
ascon.S: ascon.S:167:  Info: macro invoked from here
ascon.S: ascon.S:75: Error: too many memory references for `xor'
ascon.S: ascon.S:167:  Info: macro invoked from here
ascon.S: ascon.S:76: Error: no such instruction: `orn s9,s7,s9'
ascon.S: ascon.S:167:  Info: macro invoked from here
ascon.S: ascon.S:77: Error: too many memory references for `xor'
ascon.S: ascon.S:167:  Info: macro invoked from here
ascon.S: ascon.S:78: Error: too many memory references for `xor'
ascon.S: ascon.S:167:  Info: macro invoked from here
ascon.S: ascon.S:79: Error: too many memory references for `or'
ascon.S: ascon.S:167:  Info: macro invoked from here
ascon.S: ascon.S:80: Error: too many memory references for `xor'
ascon.S: ascon.S:167:  Info: macro invoked from here
ascon.S: ascon.S:81: Error: too many memory references for `xor'
ascon.S: ascon.S:167:  Info: macro invoked from here
ascon.S: ascon.S:82: Error: too many memory references for `or'
ascon.S: ascon.S:167:  Info: macro invoked from here
ascon.S: ...

Number of similar (implementation,compiler) pairs: 1, namely:
ImplementationCompiler
T:asm_bi32_rv32bgcc -march=native -mtune=native -O2 -fwrapv -fPIC -fPIE -gdwarf-4 -Wall (15.2.0)

Compiler output


ascon.S: /tmp/ccUCGB6M.s: Assembler messages:
ascon.S: ascon.S:159: Error: no such instruction: `j .LPloopcond'
ascon.S: ascon.S:162: Error: too many memory references for `xor'
ascon.S: ascon.S:163: Error: no such instruction: `lbu t2,1(t1)'
ascon.S: ascon.S:164: Error: too many memory references for `xor'
ascon.S: ascon.S:73: Error: too many memory references for `xor'
ascon.S: ascon.S:167:  Info: macro invoked from here
ascon.S: ascon.S:74: Error: too many memory references for `xor'
ascon.S: ascon.S:167:  Info: macro invoked from here
ascon.S: ascon.S:75: Error: too many memory references for `xor'
ascon.S: ascon.S:167:  Info: macro invoked from here
ascon.S: ascon.S:76: Error: no such instruction: `orn s9,s7,s9'
ascon.S: ascon.S:167:  Info: macro invoked from here
ascon.S: ascon.S:77: Error: too many memory references for `xor'
ascon.S: ascon.S:167:  Info: macro invoked from here
ascon.S: ascon.S:78: Error: too many memory references for `xor'
ascon.S: ascon.S:167:  Info: macro invoked from here
ascon.S: ascon.S:79: Error: too many memory references for `or'
ascon.S: ascon.S:167:  Info: macro invoked from here
ascon.S: ascon.S:80: Error: too many memory references for `xor'
ascon.S: ascon.S:167:  Info: macro invoked from here
ascon.S: ascon.S:81: Error: too many memory references for `xor'
ascon.S: ascon.S:167:  Info: macro invoked from here
ascon.S: ascon.S:82: Error: too many memory references for `or'
ascon.S: ascon.S:167:  Info: macro invoked from here
ascon.S: ...

Number of similar (implementation,compiler) pairs: 1, namely:
ImplementationCompiler
T:asm_bi32_rv32bgcc -march=native -mtune=native -O3 -fwrapv -fPIC -fPIE -gdwarf-4 -Wall (15.2.0)

Compiler output


ascon.S: /tmp/cc4mCU5B.s: Assembler messages:
ascon.S: ascon.S:159: Error: no such instruction: `j .LPloopcond'
ascon.S: ascon.S:162: Error: too many memory references for `xor'
ascon.S: ascon.S:163: Error: no such instruction: `lbu t2,1(t1)'
ascon.S: ascon.S:164: Error: too many memory references for `xor'
ascon.S: ascon.S:73: Error: too many memory references for `xor'
ascon.S: ascon.S:167:  Info: macro invoked from here
ascon.S: ascon.S:74: Error: too many memory references for `xor'
ascon.S: ascon.S:167:  Info: macro invoked from here
ascon.S: ascon.S:75: Error: too many memory references for `xor'
ascon.S: ascon.S:167:  Info: macro invoked from here
ascon.S: ascon.S:76: Error: no such instruction: `orn s9,s7,s9'
ascon.S: ascon.S:167:  Info: macro invoked from here
ascon.S: ascon.S:77: Error: too many memory references for `xor'
ascon.S: ascon.S:167:  Info: macro invoked from here
ascon.S: ascon.S:78: Error: too many memory references for `xor'
ascon.S: ascon.S:167:  Info: macro invoked from here
ascon.S: ascon.S:79: Error: too many memory references for `or'
ascon.S: ascon.S:167:  Info: macro invoked from here
ascon.S: ascon.S:80: Error: too many memory references for `xor'
ascon.S: ascon.S:167:  Info: macro invoked from here
ascon.S: ascon.S:81: Error: too many memory references for `xor'
ascon.S: ascon.S:167:  Info: macro invoked from here
ascon.S: ascon.S:82: Error: too many memory references for `or'
ascon.S: ascon.S:167:  Info: macro invoked from here
ascon.S: ...

Number of similar (implementation,compiler) pairs: 1, namely:
ImplementationCompiler
T:asm_bi32_rv32bgcc -march=native -mtune=native -O -fwrapv -fPIC -fPIE -gdwarf-4 -Wall (15.2.0)

Compiler output


ascon.S: /tmp/ccZunquo.s: Assembler messages:
ascon.S: ascon.S:159: Error: no such instruction: `j .LPloopcond'
ascon.S: ascon.S:162: Error: too many memory references for `xor'
ascon.S: ascon.S:163: Error: no such instruction: `lbu t2,1(t1)'
ascon.S: ascon.S:164: Error: too many memory references for `xor'
ascon.S: ascon.S:73: Error: too many memory references for `xor'
ascon.S: ascon.S:167:  Info: macro invoked from here
ascon.S: ascon.S:74: Error: too many memory references for `xor'
ascon.S: ascon.S:167:  Info: macro invoked from here
ascon.S: ascon.S:75: Error: too many memory references for `xor'
ascon.S: ascon.S:167:  Info: macro invoked from here
ascon.S: ascon.S:76: Error: no such instruction: `orn s9,s7,s9'
ascon.S: ascon.S:167:  Info: macro invoked from here
ascon.S: ascon.S:77: Error: too many memory references for `xor'
ascon.S: ascon.S:167:  Info: macro invoked from here
ascon.S: ascon.S:78: Error: too many memory references for `xor'
ascon.S: ascon.S:167:  Info: macro invoked from here
ascon.S: ascon.S:79: Error: too many memory references for `or'
ascon.S: ascon.S:167:  Info: macro invoked from here
ascon.S: ascon.S:80: Error: too many memory references for `xor'
ascon.S: ascon.S:167:  Info: macro invoked from here
ascon.S: ascon.S:81: Error: too many memory references for `xor'
ascon.S: ascon.S:167:  Info: macro invoked from here
ascon.S: ascon.S:82: Error: too many memory references for `or'
ascon.S: ascon.S:167:  Info: macro invoked from here
ascon.S: ...

Number of similar (implementation,compiler) pairs: 1, namely:
ImplementationCompiler
T:asm_bi32_rv32bgcc -march=native -mtune=native -Os -fwrapv -fPIC -fPIE -gdwarf-4 -Wall (15.2.0)

Compiler output


ascon.S: ascon.S:1:10: fatal error: 'xtensa/coreasm.h' file not found
ascon.S:     1 | #include <xtensa/coreasm.h>
ascon.S:       |          ^~~~~~~~~~~~~~~~~~
ascon.S: 1 error generated.

Number of similar (implementation,compiler) pairs: 4, namely:
ImplementationCompiler
T:asm_esp32clang -march=native -O2 -fwrapv -Qunused-arguments -fPIC -fPIE -gdwarf-4 -Wall (Ubuntu_Clang_21.1.8_(6ubuntu1))
T:asm_esp32clang -march=native -O3 -fwrapv -Qunused-arguments -fPIC -fPIE -gdwarf-4 -Wall (Ubuntu_Clang_21.1.8_(6ubuntu1))
T:asm_esp32clang -march=native -O -fwrapv -Qunused-arguments -fPIC -fPIE -gdwarf-4 -Wall (Ubuntu_Clang_21.1.8_(6ubuntu1))
T:asm_esp32clang -march=native -Os -fwrapv -Qunused-arguments -fPIC -fPIE -gdwarf-4 -Wall (Ubuntu_Clang_21.1.8_(6ubuntu1))

Compiler output


ascon.S: ascon.S:1:10: fatal error: xtensa/coreasm.h: No such file or directory
ascon.S:     1 | #include <xtensa/coreasm.h>
ascon.S:       |          ^~~~~~~~~~~~~~~~~~
ascon.S: compilation terminated.

Number of similar (implementation,compiler) pairs: 4, namely:
ImplementationCompiler
T:asm_esp32gcc -march=native -mtune=native -O2 -fwrapv -fPIC -fPIE -gdwarf-4 -Wall (15.2.0)
T:asm_esp32gcc -march=native -mtune=native -O3 -fwrapv -fPIC -fPIE -gdwarf-4 -Wall (15.2.0)
T:asm_esp32gcc -march=native -mtune=native -O -fwrapv -fPIC -fPIE -gdwarf-4 -Wall (15.2.0)
T:asm_esp32gcc -march=native -mtune=native -Os -fwrapv -fPIC -fPIE -gdwarf-4 -Wall (15.2.0)

Compiler output


ascon.S: ascon.S:110:5: error: invalid instruction mnemonic 'li'
ascon.S:     li t6, 0x4b
ascon.S:     ^~
ascon.S: ascon.S:113:5: error: unknown use of instruction mnemonic without a size suffix
ascon.S:     xor s5, s5, t1
ascon.S:     ^
ascon.S: <instantiation>:1:1: error: unknown use of instruction mnemonic without a size suffix
ascon.S: xor t3, s1, s9
ascon.S: ^
ascon.S: ascon.S:116:5: note: while in macro instantiation
ascon.S:     sbox s1, s3, s5, s7, s9, t4, t3, t5
ascon.S:     ^
ascon.S: <instantiation>:2:5: error: unknown use of instruction mnemonic without a size suffix
ascon.S:     xor t5, s7, s9
ascon.S:     ^
ascon.S: ascon.S:116:5: note: while in macro instantiation
ascon.S:     sbox s1, s3, s5, s7, s9, t4, t3, t5
ascon.S:     ^
ascon.S: <instantiation>:3:5: error: unknown use of instruction mnemonic without a size suffix
ascon.S:     xor t4, s3, s5
ascon.S:     ^
ascon.S: ascon.S:116:5: note: while in macro instantiation
ascon.S:     sbox s1, s3, s5, s7, s9, t4, t3, t5
ascon.S:     ^
ascon.S: <instantiation>:4:5: error: invalid instruction mnemonic 'orn'
ascon.S: ...

Number of similar (implementation,compiler) pairs: 4, namely:
ImplementationCompiler
T:asm_fsr_rv32bclang -march=native -O2 -fwrapv -Qunused-arguments -fPIC -fPIE -gdwarf-4 -Wall (Ubuntu_Clang_21.1.8_(6ubuntu1))
T:asm_fsr_rv32bclang -march=native -O3 -fwrapv -Qunused-arguments -fPIC -fPIE -gdwarf-4 -Wall (Ubuntu_Clang_21.1.8_(6ubuntu1))
T:asm_fsr_rv32bclang -march=native -O -fwrapv -Qunused-arguments -fPIC -fPIE -gdwarf-4 -Wall (Ubuntu_Clang_21.1.8_(6ubuntu1))
T:asm_fsr_rv32bclang -march=native -Os -fwrapv -Qunused-arguments -fPIC -fPIE -gdwarf-4 -Wall (Ubuntu_Clang_21.1.8_(6ubuntu1))

Compiler output


ascon.S: /tmp/cc8bQzTW.s: Assembler messages:
ascon.S: ascon.S:110: Error: no such instruction: `li t6,0x4b'
ascon.S: ascon.S:113: Error: too many memory references for `xor'
ascon.S: ascon.S:73: Error: too many memory references for `xor'
ascon.S: ascon.S:116:  Info: macro invoked from here
ascon.S: ascon.S:74: Error: too many memory references for `xor'
ascon.S: ascon.S:116:  Info: macro invoked from here
ascon.S: ascon.S:75: Error: too many memory references for `xor'
ascon.S: ascon.S:116:  Info: macro invoked from here
ascon.S: ascon.S:76: Error: no such instruction: `orn s9,s7,s9'
ascon.S: ascon.S:116:  Info: macro invoked from here
ascon.S: ascon.S:77: Error: too many memory references for `xor'
ascon.S: ascon.S:116:  Info: macro invoked from here
ascon.S: ascon.S:78: Error: too many memory references for `xor'
ascon.S: ascon.S:116:  Info: macro invoked from here
ascon.S: ascon.S:79: Error: too many memory references for `or'
ascon.S: ascon.S:116:  Info: macro invoked from here
ascon.S: ascon.S:80: Error: too many memory references for `xor'
ascon.S: ascon.S:116:  Info: macro invoked from here
ascon.S: ascon.S:81: Error: too many memory references for `xor'
ascon.S: ascon.S:116:  Info: macro invoked from here
ascon.S: ascon.S:82: Error: too many memory references for `or'
ascon.S: ascon.S:116:  Info: macro invoked from here
ascon.S: ascon.S:83: Error: too many memory references for `xor'
ascon.S: ascon.S:116:  Info: macro invoked from here
ascon.S: ...

Number of similar (implementation,compiler) pairs: 1, namely:
ImplementationCompiler
T:asm_fsr_rv32bgcc -march=native -mtune=native -O2 -fwrapv -fPIC -fPIE -gdwarf-4 -Wall (15.2.0)

Compiler output


ascon.S: /tmp/ccnmQKA3.s: Assembler messages:
ascon.S: ascon.S:110: Error: no such instruction: `li t6,0x4b'
ascon.S: ascon.S:113: Error: too many memory references for `xor'
ascon.S: ascon.S:73: Error: too many memory references for `xor'
ascon.S: ascon.S:116:  Info: macro invoked from here
ascon.S: ascon.S:74: Error: too many memory references for `xor'
ascon.S: ascon.S:116:  Info: macro invoked from here
ascon.S: ascon.S:75: Error: too many memory references for `xor'
ascon.S: ascon.S:116:  Info: macro invoked from here
ascon.S: ascon.S:76: Error: no such instruction: `orn s9,s7,s9'
ascon.S: ascon.S:116:  Info: macro invoked from here
ascon.S: ascon.S:77: Error: too many memory references for `xor'
ascon.S: ascon.S:116:  Info: macro invoked from here
ascon.S: ascon.S:78: Error: too many memory references for `xor'
ascon.S: ascon.S:116:  Info: macro invoked from here
ascon.S: ascon.S:79: Error: too many memory references for `or'
ascon.S: ascon.S:116:  Info: macro invoked from here
ascon.S: ascon.S:80: Error: too many memory references for `xor'
ascon.S: ascon.S:116:  Info: macro invoked from here
ascon.S: ascon.S:81: Error: too many memory references for `xor'
ascon.S: ascon.S:116:  Info: macro invoked from here
ascon.S: ascon.S:82: Error: too many memory references for `or'
ascon.S: ascon.S:116:  Info: macro invoked from here
ascon.S: ascon.S:83: Error: too many memory references for `xor'
ascon.S: ascon.S:116:  Info: macro invoked from here
ascon.S: ...

Number of similar (implementation,compiler) pairs: 1, namely:
ImplementationCompiler
T:asm_fsr_rv32bgcc -march=native -mtune=native -O3 -fwrapv -fPIC -fPIE -gdwarf-4 -Wall (15.2.0)

Compiler output


ascon.S: /tmp/cc6vxVjP.s: Assembler messages:
ascon.S: ascon.S:110: Error: no such instruction: `li t6,0x4b'
ascon.S: ascon.S:113: Error: too many memory references for `xor'
ascon.S: ascon.S:73: Error: too many memory references for `xor'
ascon.S: ascon.S:116:  Info: macro invoked from here
ascon.S: ascon.S:74: Error: too many memory references for `xor'
ascon.S: ascon.S:116:  Info: macro invoked from here
ascon.S: ascon.S:75: Error: too many memory references for `xor'
ascon.S: ascon.S:116:  Info: macro invoked from here
ascon.S: ascon.S:76: Error: no such instruction: `orn s9,s7,s9'
ascon.S: ascon.S:116:  Info: macro invoked from here
ascon.S: ascon.S:77: Error: too many memory references for `xor'
ascon.S: ascon.S:116:  Info: macro invoked from here
ascon.S: ascon.S:78: Error: too many memory references for `xor'
ascon.S: ascon.S:116:  Info: macro invoked from here
ascon.S: ascon.S:79: Error: too many memory references for `or'
ascon.S: ascon.S:116:  Info: macro invoked from here
ascon.S: ascon.S:80: Error: too many memory references for `xor'
ascon.S: ascon.S:116:  Info: macro invoked from here
ascon.S: ascon.S:81: Error: too many memory references for `xor'
ascon.S: ascon.S:116:  Info: macro invoked from here
ascon.S: ascon.S:82: Error: too many memory references for `or'
ascon.S: ascon.S:116:  Info: macro invoked from here
ascon.S: ascon.S:83: Error: too many memory references for `xor'
ascon.S: ascon.S:116:  Info: macro invoked from here
ascon.S: ...

Number of similar (implementation,compiler) pairs: 1, namely:
ImplementationCompiler
T:asm_fsr_rv32bgcc -march=native -mtune=native -O -fwrapv -fPIC -fPIE -gdwarf-4 -Wall (15.2.0)

Compiler output


ascon.S: /tmp/ccQeD1Eg.s: Assembler messages:
ascon.S: ascon.S:110: Error: no such instruction: `li t6,0x4b'
ascon.S: ascon.S:113: Error: too many memory references for `xor'
ascon.S: ascon.S:73: Error: too many memory references for `xor'
ascon.S: ascon.S:116:  Info: macro invoked from here
ascon.S: ascon.S:74: Error: too many memory references for `xor'
ascon.S: ascon.S:116:  Info: macro invoked from here
ascon.S: ascon.S:75: Error: too many memory references for `xor'
ascon.S: ascon.S:116:  Info: macro invoked from here
ascon.S: ascon.S:76: Error: no such instruction: `orn s9,s7,s9'
ascon.S: ascon.S:116:  Info: macro invoked from here
ascon.S: ascon.S:77: Error: too many memory references for `xor'
ascon.S: ascon.S:116:  Info: macro invoked from here
ascon.S: ascon.S:78: Error: too many memory references for `xor'
ascon.S: ascon.S:116:  Info: macro invoked from here
ascon.S: ascon.S:79: Error: too many memory references for `or'
ascon.S: ascon.S:116:  Info: macro invoked from here
ascon.S: ascon.S:80: Error: too many memory references for `xor'
ascon.S: ascon.S:116:  Info: macro invoked from here
ascon.S: ascon.S:81: Error: too many memory references for `xor'
ascon.S: ascon.S:116:  Info: macro invoked from here
ascon.S: ascon.S:82: Error: too many memory references for `or'
ascon.S: ascon.S:116:  Info: macro invoked from here
ascon.S: ascon.S:83: Error: too many memory references for `xor'
ascon.S: ascon.S:116:  Info: macro invoked from here
ascon.S: ...

Number of similar (implementation,compiler) pairs: 1, namely:
ImplementationCompiler
T:asm_fsr_rv32bgcc -march=native -mtune=native -Os -fwrapv -fPIC -fPIE -gdwarf-4 -Wall (15.2.0)

Compiler output


ascon.S: ascon.S:118:5: error: invalid instruction mnemonic 'li'
ascon.S:     li t6, 0x4b
ascon.S:     ^~
ascon.S: ascon.S:121:5: error: unknown use of instruction mnemonic without a size suffix
ascon.S:     xor s5, s5, t1
ascon.S:     ^
ascon.S: <instantiation>:1:1: error: unknown use of instruction mnemonic without a size suffix
ascon.S: xor t3, s1, s9
ascon.S: ^
ascon.S: ascon.S:124:5: note: while in macro instantiation
ascon.S:     sbox s1, s3, s5, s7, s9, t4, t3, t5
ascon.S:     ^
ascon.S: <instantiation>:2:5: error: unknown use of instruction mnemonic without a size suffix
ascon.S:     xor t5, s7, s9
ascon.S:     ^
ascon.S: ascon.S:124:5: note: while in macro instantiation
ascon.S:     sbox s1, s3, s5, s7, s9, t4, t3, t5
ascon.S:     ^
ascon.S: <instantiation>:3:5: error: unknown use of instruction mnemonic without a size suffix
ascon.S:     xor t4, s3, s5
ascon.S:     ^
ascon.S: ascon.S:124:5: note: while in macro instantiation
ascon.S:     sbox s1, s3, s5, s7, s9, t4, t3, t5
ascon.S:     ^
ascon.S: <instantiation>:4:5: error: invalid instruction mnemonic 'orn'
ascon.S: ...

Number of similar (implementation,compiler) pairs: 4, namely:
ImplementationCompiler
T:asm_rv32bclang -march=native -O2 -fwrapv -Qunused-arguments -fPIC -fPIE -gdwarf-4 -Wall (Ubuntu_Clang_21.1.8_(6ubuntu1))
T:asm_rv32bclang -march=native -O3 -fwrapv -Qunused-arguments -fPIC -fPIE -gdwarf-4 -Wall (Ubuntu_Clang_21.1.8_(6ubuntu1))
T:asm_rv32bclang -march=native -O -fwrapv -Qunused-arguments -fPIC -fPIE -gdwarf-4 -Wall (Ubuntu_Clang_21.1.8_(6ubuntu1))
T:asm_rv32bclang -march=native -Os -fwrapv -Qunused-arguments -fPIC -fPIE -gdwarf-4 -Wall (Ubuntu_Clang_21.1.8_(6ubuntu1))

Compiler output


ascon.S: /tmp/ccJ9JZzL.s: Assembler messages:
ascon.S: ascon.S:118: Error: no such instruction: `li t6,0x4b'
ascon.S: ascon.S:121: Error: too many memory references for `xor'
ascon.S: ascon.S:73: Error: too many memory references for `xor'
ascon.S: ascon.S:124:  Info: macro invoked from here
ascon.S: ascon.S:74: Error: too many memory references for `xor'
ascon.S: ascon.S:124:  Info: macro invoked from here
ascon.S: ascon.S:75: Error: too many memory references for `xor'
ascon.S: ascon.S:124:  Info: macro invoked from here
ascon.S: ascon.S:76: Error: no such instruction: `orn s9,s7,s9'
ascon.S: ascon.S:124:  Info: macro invoked from here
ascon.S: ascon.S:77: Error: too many memory references for `xor'
ascon.S: ascon.S:124:  Info: macro invoked from here
ascon.S: ascon.S:78: Error: too many memory references for `xor'
ascon.S: ascon.S:124:  Info: macro invoked from here
ascon.S: ascon.S:79: Error: too many memory references for `or'
ascon.S: ascon.S:124:  Info: macro invoked from here
ascon.S: ascon.S:80: Error: too many memory references for `xor'
ascon.S: ascon.S:124:  Info: macro invoked from here
ascon.S: ascon.S:81: Error: too many memory references for `xor'
ascon.S: ascon.S:124:  Info: macro invoked from here
ascon.S: ascon.S:82: Error: too many memory references for `or'
ascon.S: ascon.S:124:  Info: macro invoked from here
ascon.S: ascon.S:83: Error: too many memory references for `xor'
ascon.S: ascon.S:124:  Info: macro invoked from here
ascon.S: ...

Number of similar (implementation,compiler) pairs: 1, namely:
ImplementationCompiler
T:asm_rv32bgcc -march=native -mtune=native -O2 -fwrapv -fPIC -fPIE -gdwarf-4 -Wall (15.2.0)

Compiler output


ascon.S: /tmp/cc0IPxnt.s: Assembler messages:
ascon.S: ascon.S:118: Error: no such instruction: `li t6,0x4b'
ascon.S: ascon.S:121: Error: too many memory references for `xor'
ascon.S: ascon.S:73: Error: too many memory references for `xor'
ascon.S: ascon.S:124:  Info: macro invoked from here
ascon.S: ascon.S:74: Error: too many memory references for `xor'
ascon.S: ascon.S:124:  Info: macro invoked from here
ascon.S: ascon.S:75: Error: too many memory references for `xor'
ascon.S: ascon.S:124:  Info: macro invoked from here
ascon.S: ascon.S:76: Error: no such instruction: `orn s9,s7,s9'
ascon.S: ascon.S:124:  Info: macro invoked from here
ascon.S: ascon.S:77: Error: too many memory references for `xor'
ascon.S: ascon.S:124:  Info: macro invoked from here
ascon.S: ascon.S:78: Error: too many memory references for `xor'
ascon.S: ascon.S:124:  Info: macro invoked from here
ascon.S: ascon.S:79: Error: too many memory references for `or'
ascon.S: ascon.S:124:  Info: macro invoked from here
ascon.S: ascon.S:80: Error: too many memory references for `xor'
ascon.S: ascon.S:124:  Info: macro invoked from here
ascon.S: ascon.S:81: Error: too many memory references for `xor'
ascon.S: ascon.S:124:  Info: macro invoked from here
ascon.S: ascon.S:82: Error: too many memory references for `or'
ascon.S: ascon.S:124:  Info: macro invoked from here
ascon.S: ascon.S:83: Error: too many memory references for `xor'
ascon.S: ascon.S:124:  Info: macro invoked from here
ascon.S: ...

Number of similar (implementation,compiler) pairs: 1, namely:
ImplementationCompiler
T:asm_rv32bgcc -march=native -mtune=native -O3 -fwrapv -fPIC -fPIE -gdwarf-4 -Wall (15.2.0)

Compiler output


ascon.S: /tmp/ccgmVTEK.s: Assembler messages:
ascon.S: ascon.S:118: Error: no such instruction: `li t6,0x4b'
ascon.S: ascon.S:121: Error: too many memory references for `xor'
ascon.S: ascon.S:73: Error: too many memory references for `xor'
ascon.S: ascon.S:124:  Info: macro invoked from here
ascon.S: ascon.S:74: Error: too many memory references for `xor'
ascon.S: ascon.S:124:  Info: macro invoked from here
ascon.S: ascon.S:75: Error: too many memory references for `xor'
ascon.S: ascon.S:124:  Info: macro invoked from here
ascon.S: ascon.S:76: Error: no such instruction: `orn s9,s7,s9'
ascon.S: ascon.S:124:  Info: macro invoked from here
ascon.S: ascon.S:77: Error: too many memory references for `xor'
ascon.S: ascon.S:124:  Info: macro invoked from here
ascon.S: ascon.S:78: Error: too many memory references for `xor'
ascon.S: ascon.S:124:  Info: macro invoked from here
ascon.S: ascon.S:79: Error: too many memory references for `or'
ascon.S: ascon.S:124:  Info: macro invoked from here
ascon.S: ascon.S:80: Error: too many memory references for `xor'
ascon.S: ascon.S:124:  Info: macro invoked from here
ascon.S: ascon.S:81: Error: too many memory references for `xor'
ascon.S: ascon.S:124:  Info: macro invoked from here
ascon.S: ascon.S:82: Error: too many memory references for `or'
ascon.S: ascon.S:124:  Info: macro invoked from here
ascon.S: ascon.S:83: Error: too many memory references for `xor'
ascon.S: ascon.S:124:  Info: macro invoked from here
ascon.S: ...

Number of similar (implementation,compiler) pairs: 1, namely:
ImplementationCompiler
T:asm_rv32bgcc -march=native -mtune=native -O -fwrapv -fPIC -fPIE -gdwarf-4 -Wall (15.2.0)

Compiler output


ascon.S: /tmp/ccimR87S.s: Assembler messages:
ascon.S: ascon.S:118: Error: no such instruction: `li t6,0x4b'
ascon.S: ascon.S:121: Error: too many memory references for `xor'
ascon.S: ascon.S:73: Error: too many memory references for `xor'
ascon.S: ascon.S:124:  Info: macro invoked from here
ascon.S: ascon.S:74: Error: too many memory references for `xor'
ascon.S: ascon.S:124:  Info: macro invoked from here
ascon.S: ascon.S:75: Error: too many memory references for `xor'
ascon.S: ascon.S:124:  Info: macro invoked from here
ascon.S: ascon.S:76: Error: no such instruction: `orn s9,s7,s9'
ascon.S: ascon.S:124:  Info: macro invoked from here
ascon.S: ascon.S:77: Error: too many memory references for `xor'
ascon.S: ascon.S:124:  Info: macro invoked from here
ascon.S: ascon.S:78: Error: too many memory references for `xor'
ascon.S: ascon.S:124:  Info: macro invoked from here
ascon.S: ascon.S:79: Error: too many memory references for `or'
ascon.S: ascon.S:124:  Info: macro invoked from here
ascon.S: ascon.S:80: Error: too many memory references for `xor'
ascon.S: ascon.S:124:  Info: macro invoked from here
ascon.S: ascon.S:81: Error: too many memory references for `xor'
ascon.S: ascon.S:124:  Info: macro invoked from here
ascon.S: ascon.S:82: Error: too many memory references for `or'
ascon.S: ascon.S:124:  Info: macro invoked from here
ascon.S: ascon.S:83: Error: too many memory references for `xor'
ascon.S: ascon.S:124:  Info: macro invoked from here
ascon.S: ...

Number of similar (implementation,compiler) pairs: 1, namely:
ImplementationCompiler
T:asm_rv32bgcc -march=native -mtune=native -Os -fwrapv -fPIC -fPIE -gdwarf-4 -Wall (15.2.0)

Compiler output


ascon.S: ascon.S:120:5: error: invalid instruction mnemonic 'li'
ascon.S:     li t6, 0x4b
ascon.S:     ^~
ascon.S: ascon.S:123:5: error: unknown use of instruction mnemonic without a size suffix
ascon.S:     xor s5, s5, t1
ascon.S:     ^
ascon.S: <instantiation>:1:1: error: unknown use of instruction mnemonic without a size suffix
ascon.S: xor t3, s1, s9
ascon.S: ^
ascon.S: ascon.S:126:5: note: while in macro instantiation
ascon.S:     sbox s1, s3, s5, s7, s9, t4, t3, t5
ascon.S:     ^
ascon.S: <instantiation>:2:5: error: unknown use of instruction mnemonic without a size suffix
ascon.S:     xor t5, s7, s9
ascon.S:     ^
ascon.S: ascon.S:126:5: note: while in macro instantiation
ascon.S:     sbox s1, s3, s5, s7, s9, t4, t3, t5
ascon.S:     ^
ascon.S: <instantiation>:3:5: error: invalid instruction mnemonic 'xori'
ascon.S:     xori s9, s9, -1
ascon.S:     ^~~~
ascon.S: ascon.S:126:5: note: while in macro instantiation
ascon.S:     sbox s1, s3, s5, s7, s9, t4, t3, t5
ascon.S:     ^
ascon.S: <instantiation>:4:5: error: unknown use of instruction mnemonic without a size suffix
ascon.S: ...

Number of similar (implementation,compiler) pairs: 4, namely:
ImplementationCompiler
T:asm_rv32iclang -march=native -O2 -fwrapv -Qunused-arguments -fPIC -fPIE -gdwarf-4 -Wall (Ubuntu_Clang_21.1.8_(6ubuntu1))
T:asm_rv32iclang -march=native -O3 -fwrapv -Qunused-arguments -fPIC -fPIE -gdwarf-4 -Wall (Ubuntu_Clang_21.1.8_(6ubuntu1))
T:asm_rv32iclang -march=native -O -fwrapv -Qunused-arguments -fPIC -fPIE -gdwarf-4 -Wall (Ubuntu_Clang_21.1.8_(6ubuntu1))
T:asm_rv32iclang -march=native -Os -fwrapv -Qunused-arguments -fPIC -fPIE -gdwarf-4 -Wall (Ubuntu_Clang_21.1.8_(6ubuntu1))

Compiler output


ascon.S: /tmp/ccFkrGTv.s: Assembler messages:
ascon.S: ascon.S:120: Error: no such instruction: `li t6,0x4b'
ascon.S: ascon.S:123: Error: too many memory references for `xor'
ascon.S: ascon.S:73: Error: too many memory references for `xor'
ascon.S: ascon.S:126:  Info: macro invoked from here
ascon.S: ascon.S:74: Error: too many memory references for `xor'
ascon.S: ascon.S:126:  Info: macro invoked from here
ascon.S: ascon.S:75: Error: no such instruction: `xori s9,s9,-1'
ascon.S: ascon.S:126:  Info: macro invoked from here
ascon.S: ascon.S:76: Error: too many memory references for `xor'
ascon.S: ascon.S:126:  Info: macro invoked from here
ascon.S: ascon.S:77: Error: too many memory references for `or'
ascon.S: ascon.S:126:  Info: macro invoked from here
ascon.S: ascon.S:78: Error: too many memory references for `xor'
ascon.S: ascon.S:126:  Info: macro invoked from here
ascon.S: ascon.S:79: Error: too many memory references for `xor'
ascon.S: ascon.S:126:  Info: macro invoked from here
ascon.S: ascon.S:80: Error: too many memory references for `or'
ascon.S: ascon.S:126:  Info: macro invoked from here
ascon.S: ascon.S:81: Error: too many memory references for `xor'
ascon.S: ascon.S:126:  Info: macro invoked from here
ascon.S: ascon.S:82: Error: too many memory references for `xor'
ascon.S: ascon.S:126:  Info: macro invoked from here
ascon.S: ascon.S:83: Error: too many memory references for `or'
ascon.S: ascon.S:126:  Info: macro invoked from here
ascon.S: ...

Number of similar (implementation,compiler) pairs: 1, namely:
ImplementationCompiler
T:asm_rv32igcc -march=native -mtune=native -O2 -fwrapv -fPIC -fPIE -gdwarf-4 -Wall (15.2.0)

Compiler output


ascon.S: /tmp/ccTpe7JB.s: Assembler messages:
ascon.S: ascon.S:120: Error: no such instruction: `li t6,0x4b'
ascon.S: ascon.S:123: Error: too many memory references for `xor'
ascon.S: ascon.S:73: Error: too many memory references for `xor'
ascon.S: ascon.S:126:  Info: macro invoked from here
ascon.S: ascon.S:74: Error: too many memory references for `xor'
ascon.S: ascon.S:126:  Info: macro invoked from here
ascon.S: ascon.S:75: Error: no such instruction: `xori s9,s9,-1'
ascon.S: ascon.S:126:  Info: macro invoked from here
ascon.S: ascon.S:76: Error: too many memory references for `xor'
ascon.S: ascon.S:126:  Info: macro invoked from here
ascon.S: ascon.S:77: Error: too many memory references for `or'
ascon.S: ascon.S:126:  Info: macro invoked from here
ascon.S: ascon.S:78: Error: too many memory references for `xor'
ascon.S: ascon.S:126:  Info: macro invoked from here
ascon.S: ascon.S:79: Error: too many memory references for `xor'
ascon.S: ascon.S:126:  Info: macro invoked from here
ascon.S: ascon.S:80: Error: too many memory references for `or'
ascon.S: ascon.S:126:  Info: macro invoked from here
ascon.S: ascon.S:81: Error: too many memory references for `xor'
ascon.S: ascon.S:126:  Info: macro invoked from here
ascon.S: ascon.S:82: Error: too many memory references for `xor'
ascon.S: ascon.S:126:  Info: macro invoked from here
ascon.S: ascon.S:83: Error: too many memory references for `or'
ascon.S: ascon.S:126:  Info: macro invoked from here
ascon.S: ...

Number of similar (implementation,compiler) pairs: 1, namely:
ImplementationCompiler
T:asm_rv32igcc -march=native -mtune=native -O3 -fwrapv -fPIC -fPIE -gdwarf-4 -Wall (15.2.0)

Compiler output


ascon.S: /tmp/cc9qBKu7.s: Assembler messages:
ascon.S: ascon.S:120: Error: no such instruction: `li t6,0x4b'
ascon.S: ascon.S:123: Error: too many memory references for `xor'
ascon.S: ascon.S:73: Error: too many memory references for `xor'
ascon.S: ascon.S:126:  Info: macro invoked from here
ascon.S: ascon.S:74: Error: too many memory references for `xor'
ascon.S: ascon.S:126:  Info: macro invoked from here
ascon.S: ascon.S:75: Error: no such instruction: `xori s9,s9,-1'
ascon.S: ascon.S:126:  Info: macro invoked from here
ascon.S: ascon.S:76: Error: too many memory references for `xor'
ascon.S: ascon.S:126:  Info: macro invoked from here
ascon.S: ascon.S:77: Error: too many memory references for `or'
ascon.S: ascon.S:126:  Info: macro invoked from here
ascon.S: ascon.S:78: Error: too many memory references for `xor'
ascon.S: ascon.S:126:  Info: macro invoked from here
ascon.S: ascon.S:79: Error: too many memory references for `xor'
ascon.S: ascon.S:126:  Info: macro invoked from here
ascon.S: ascon.S:80: Error: too many memory references for `or'
ascon.S: ascon.S:126:  Info: macro invoked from here
ascon.S: ascon.S:81: Error: too many memory references for `xor'
ascon.S: ascon.S:126:  Info: macro invoked from here
ascon.S: ascon.S:82: Error: too many memory references for `xor'
ascon.S: ascon.S:126:  Info: macro invoked from here
ascon.S: ascon.S:83: Error: too many memory references for `or'
ascon.S: ascon.S:126:  Info: macro invoked from here
ascon.S: ...

Number of similar (implementation,compiler) pairs: 1, namely:
ImplementationCompiler
T:asm_rv32igcc -march=native -mtune=native -O -fwrapv -fPIC -fPIE -gdwarf-4 -Wall (15.2.0)

Compiler output


ascon.S: /tmp/cc7P4SIL.s: Assembler messages:
ascon.S: ascon.S:120: Error: no such instruction: `li t6,0x4b'
ascon.S: ascon.S:123: Error: too many memory references for `xor'
ascon.S: ascon.S:73: Error: too many memory references for `xor'
ascon.S: ascon.S:126:  Info: macro invoked from here
ascon.S: ascon.S:74: Error: too many memory references for `xor'
ascon.S: ascon.S:126:  Info: macro invoked from here
ascon.S: ascon.S:75: Error: no such instruction: `xori s9,s9,-1'
ascon.S: ascon.S:126:  Info: macro invoked from here
ascon.S: ascon.S:76: Error: too many memory references for `xor'
ascon.S: ascon.S:126:  Info: macro invoked from here
ascon.S: ascon.S:77: Error: too many memory references for `or'
ascon.S: ascon.S:126:  Info: macro invoked from here
ascon.S: ascon.S:78: Error: too many memory references for `xor'
ascon.S: ascon.S:126:  Info: macro invoked from here
ascon.S: ascon.S:79: Error: too many memory references for `xor'
ascon.S: ascon.S:126:  Info: macro invoked from here
ascon.S: ascon.S:80: Error: too many memory references for `or'
ascon.S: ascon.S:126:  Info: macro invoked from here
ascon.S: ascon.S:81: Error: too many memory references for `xor'
ascon.S: ascon.S:126:  Info: macro invoked from here
ascon.S: ascon.S:82: Error: too many memory references for `xor'
ascon.S: ascon.S:126:  Info: macro invoked from here
ascon.S: ascon.S:83: Error: too many memory references for `or'
ascon.S: ascon.S:126:  Info: macro invoked from here
ascon.S: ...

Number of similar (implementation,compiler) pairs: 1, namely:
ImplementationCompiler
T:asm_rv32igcc -march=native -mtune=native -Os -fwrapv -fPIC -fPIE -gdwarf-4 -Wall (15.2.0)

Compiler output


aead.c: aead.c:35:18: error: static declaration of 'ascon_initaead' follows non-static declaration
aead.c:    35 | forceinline void ascon_initaead(ascon_state_t* s, const ascon_key_t* key,
aead.c:       |                  ^
aead.c: ./ascon.h:22:6: note: previous declaration is here
aead.c:    22 | void ascon_initaead(ascon_state_t* s, const ascon_key_t* key,
aead.c:       |      ^
aead.c: aead.c:57:18: error: static declaration of 'ascon_adata' follows non-static declaration
aead.c:    57 | forceinline void ascon_adata(ascon_state_t* s, const uint8_t* ad,
aead.c:       |                  ^
aead.c: ./ascon.h:24:6: note: previous declaration is here
aead.c:    24 | void ascon_adata(ascon_state_t* s, const uint8_t* ad, uint64_t adlen);
aead.c:       |      ^
aead.c: aead.c:93:18: error: static declaration of 'ascon_encrypt' follows non-static declaration
aead.c:    93 | forceinline void ascon_encrypt(ascon_state_t* s, uint8_t* c, const uint8_t* m,
aead.c:       |                  ^
aead.c: ./ascon.h:25:6: note: previous declaration is here
aead.c:    25 | void ascon_encrypt(ascon_state_t* s, uint8_t* c, const uint8_t* m,
aead.c:       |      ^
aead.c: aead.c:131:18: error: static declaration of 'ascon_decrypt' follows non-static declaration
aead.c:   131 | forceinline void ascon_decrypt(ascon_state_t* s, uint8_t* m, const uint8_t* c,
aead.c:       |                  ^
aead.c: ./ascon.h:27:6: note: previous declaration is here
aead.c:    27 | void ascon_decrypt(ascon_state_t* s, uint8_t* m, const uint8_t* c,
aead.c:       |      ^
aead.c: aead.c:175:18: error: static declaration of 'ascon_final' follows non-static declaration
aead.c: ...

Number of similar (implementation,compiler) pairs: 4, namely:
ImplementationCompiler
avx512clang -march=native -O2 -fwrapv -Qunused-arguments -fPIC -fPIE -gdwarf-4 -Wall (Ubuntu_Clang_21.1.8_(6ubuntu1))
avx512clang -march=native -O3 -fwrapv -Qunused-arguments -fPIC -fPIE -gdwarf-4 -Wall (Ubuntu_Clang_21.1.8_(6ubuntu1))
avx512clang -march=native -O -fwrapv -Qunused-arguments -fPIC -fPIE -gdwarf-4 -Wall (Ubuntu_Clang_21.1.8_(6ubuntu1))
avx512clang -march=native -Os -fwrapv -Qunused-arguments -fPIC -fPIE -gdwarf-4 -Wall (Ubuntu_Clang_21.1.8_(6ubuntu1))

Compiler output


aead.c: aead.c:35:18: error: static declaration of 'ascon_initaead' follows non-static declaration
aead.c:    35 | forceinline void ascon_initaead(ascon_state_t* s, const ascon_key_t* key,
aead.c:       |                  ^~~~~~~~~~~~~~
aead.c: In file included from aead.c:2:
aead.c: ascon.h:22:6: note: previous declaration of 'ascon_initaead' with type 'void(ascon_state_t *, const ascon_key_t *, const uint8_t *)' {aka 'void(ascon_state_t *, const ascon_key_t *, const unsigned char *)'}
aead.c:    22 | void ascon_initaead(ascon_state_t* s, const ascon_key_t* key,
aead.c:       |      ^~~~~~~~~~~~~~
aead.c: aead.c:57:18: error: static declaration of 'ascon_adata' follows non-static declaration
aead.c:    57 | forceinline void ascon_adata(ascon_state_t* s, const uint8_t* ad,
aead.c:       |                  ^~~~~~~~~~~
aead.c: ascon.h:24:6: note: previous declaration of 'ascon_adata' with type 'void(ascon_state_t *, const uint8_t *, uint64_t)' {aka 'void(ascon_state_t *, const unsigned char *, long unsigned int)'}
aead.c:    24 | void ascon_adata(ascon_state_t* s, const uint8_t* ad, uint64_t adlen);
aead.c:       |      ^~~~~~~~~~~
aead.c: aead.c:93:18: error: static declaration of 'ascon_encrypt' follows non-static declaration
aead.c:    93 | forceinline void ascon_encrypt(ascon_state_t* s, uint8_t* c, const uint8_t* m,
aead.c:       |                  ^~~~~~~~~~~~~
aead.c: ascon.h:25:6: note: previous declaration of 'ascon_encrypt' with type 'void(ascon_state_t *, uint8_t *, const uint8_t *, uint64_t)' {aka 'void(ascon_state_t *, unsigned char *, const unsigned char *, long unsigned int)'}
aead.c:    25 | void ascon_encrypt(ascon_state_t* s, uint8_t* c, const uint8_t* m,
aead.c:       |      ^~~~~~~~~~~~~
aead.c: aead.c:131:18: error: static declaration of 'ascon_decrypt' follows non-static declaration
aead.c:   131 | forceinline void ascon_decrypt(ascon_state_t* s, uint8_t* m, const uint8_t* c,
aead.c:       |                  ^~~~~~~~~~~~~
aead.c: ascon.h:27:6: note: previous declaration of 'ascon_decrypt' with type 'void(ascon_state_t *, uint8_t *, const uint8_t *, uint64_t)' {aka 'void(ascon_state_t *, unsigned char *, const unsigned char *, long unsigned int)'}
aead.c:    27 | void ascon_decrypt(ascon_state_t* s, uint8_t* m, const uint8_t* c,
aead.c:       |      ^~~~~~~~~~~~~
aead.c: ...

Number of similar (implementation,compiler) pairs: 4, namely:
ImplementationCompiler
avx512gcc -march=native -mtune=native -O2 -fwrapv -fPIC -fPIE -gdwarf-4 -Wall (15.2.0)
avx512gcc -march=native -mtune=native -O3 -fwrapv -fPIC -fPIE -gdwarf-4 -Wall (15.2.0)
avx512gcc -march=native -mtune=native -O -fwrapv -fPIC -fPIE -gdwarf-4 -Wall (15.2.0)
avx512gcc -march=native -mtune=native -Os -fwrapv -fPIC -fPIE -gdwarf-4 -Wall (15.2.0)

Compiler output


try.c: /usr/bin/x86_64-linux-gnu-ld.bfd: /tmp/try-small-bd5e78.o: in function `doit':
try.c: .../supercop-data/hertz/amd64/try/c/clang_-march=native_-O2_-fwrapv_-Qunused-arguments_-fPIC_-fPIE_-gdwarf-4_-Wall/timingleaks/crypto_aead/ascon128av12/esp32/work/./try.c:133:(.text+0x...): undefined reference to `crypto_aead_ascon128av12_esp32_timingleaks_encrypt'
try.c: /usr/bin/x86_64-linux-gnu-ld.bfd: .../supercop-data/hertz/amd64/try/c/clang_-march=native_-O2_-fwrapv_-Qunused-arguments_-fPIC_-fPIE_-gdwarf-4_-Wall/timingleaks/crypto_aead/ascon128av12/esp32/work/./try.c:135:(.text+0x...): undefined reference to `crypto_aead_ascon128av12_esp32_timingleaks_decrypt'
try.c: /usr/bin/x86_64-linux-gnu-ld.bfd: /tmp/try-small-bd5e78.o: in function `test':
try.c: .../supercop-data/hertz/amd64/try/c/clang_-march=native_-O2_-fwrapv_-Qunused-arguments_-fPIC_-fPIE_-gdwarf-4_-Wall/timingleaks/crypto_aead/ascon128av12/esp32/work/./try.c:159:(.text+0x...): undefined reference to `crypto_aead_ascon128av12_esp32_timingleaks_encrypt'
try.c: /usr/bin/x86_64-linux-gnu-ld.bfd: .../supercop-data/hertz/amd64/try/c/clang_-march=native_-O2_-fwrapv_-Qunused-arguments_-fPIC_-fPIE_-gdwarf-4_-Wall/timingleaks/crypto_aead/ascon128av12/esp32/work/./try.c:189:(.text+0x...): undefined reference to `crypto_aead_ascon128av12_esp32_timingleaks_encrypt'
try.c: /usr/bin/x86_64-linux-gnu-ld.bfd: .../supercop-data/hertz/amd64/try/c/clang_-march=native_-O2_-fwrapv_-Qunused-arguments_-fPIC_-fPIE_-gdwarf-4_-Wall/timingleaks/crypto_aead/ascon128av12/esp32/work/./try.c:300:(.text+0x...): undefined reference to `crypto_aead_ascon128av12_esp32_timingleaks_decrypt'
try.c: /usr/bin/x86_64-linux-gnu-ld.bfd: .../supercop-data/hertz/amd64/try/c/clang_-march=native_-O2_-fwrapv_-Qunused-arguments_-fPIC_-fPIE_-gdwarf-4_-Wall/timingleaks/crypto_aead/ascon128av12/esp32/work/./try.c:331:(.text+0x...): undefined reference to `crypto_aead_ascon128av12_esp32_timingleaks_decrypt'
try.c: /usr/bin/x86_64-linux-gnu-ld.bfd: .../supercop-data/hertz/amd64/try/c/clang_-march=native_-O2_-fwrapv_-Qunused-arguments_-fPIC_-fPIE_-gdwarf-4_-Wall/timingleaks/crypto_aead/ascon128av12/esp32/work/./try.c:476:(.text+0x...): undefined reference to `crypto_aead_ascon128av12_esp32_timingleaks_decrypt'
try.c: /usr/bin/x86_64-linux-gnu-ld.bfd: .../supercop-data/hertz/amd64/try/c/clang_-march=native_-O2_-fwrapv_-Qunused-arguments_-fPIC_-fPIE_-gdwarf-4_-Wall/timingleaks/crypto_aead/ascon128av12/esp32/work/./try.c:480:(.text+0x...): undefined reference to `crypto_aead_ascon128av12_esp32_timingleaks_decrypt'
try.c: /usr/bin/x86_64-linux-gnu-ld.bfd: .../supercop-data/hertz/amd64/try/c/clang_-march=native_-O2_-fwrapv_-Qunused-arguments_-fPIC_-fPIE_-gdwarf-4_-Wall/timingleaks/crypto_aead/ascon128av12/esp32/work/./try.c:484:(.text+0x...): undefined reference to `crypto_aead_ascon128av12_esp32_timingleaks_decrypt'
try.c: clang: error: linker command failed with exit code 1 (use -v to see invocation)

Number of similar (implementation,compiler) pairs: 1, namely:
ImplementationCompiler
T:esp32clang -march=native -O2 -fwrapv -Qunused-arguments -fPIC -fPIE -gdwarf-4 -Wall (Ubuntu_Clang_21.1.8_(6ubuntu1))

Compiler output


try.c: /usr/bin/x86_64-linux-gnu-ld.bfd: /tmp/try-small-50398b.o: in function `doit':
try.c: .../supercop-data/hertz/amd64/try/c/clang_-march=native_-O3_-fwrapv_-Qunused-arguments_-fPIC_-fPIE_-gdwarf-4_-Wall/timingleaks/crypto_aead/ascon128av12/esp32/work/./try.c:133:(.text+0x...): undefined reference to `crypto_aead_ascon128av12_esp32_timingleaks_encrypt'
try.c: /usr/bin/x86_64-linux-gnu-ld.bfd: .../supercop-data/hertz/amd64/try/c/clang_-march=native_-O3_-fwrapv_-Qunused-arguments_-fPIC_-fPIE_-gdwarf-4_-Wall/timingleaks/crypto_aead/ascon128av12/esp32/work/./try.c:135:(.text+0x...): undefined reference to `crypto_aead_ascon128av12_esp32_timingleaks_decrypt'
try.c: /usr/bin/x86_64-linux-gnu-ld.bfd: /tmp/try-small-50398b.o: in function `test':
try.c: .../supercop-data/hertz/amd64/try/c/clang_-march=native_-O3_-fwrapv_-Qunused-arguments_-fPIC_-fPIE_-gdwarf-4_-Wall/timingleaks/crypto_aead/ascon128av12/esp32/work/./try.c:159:(.text+0x...): undefined reference to `crypto_aead_ascon128av12_esp32_timingleaks_encrypt'
try.c: /usr/bin/x86_64-linux-gnu-ld.bfd: .../supercop-data/hertz/amd64/try/c/clang_-march=native_-O3_-fwrapv_-Qunused-arguments_-fPIC_-fPIE_-gdwarf-4_-Wall/timingleaks/crypto_aead/ascon128av12/esp32/work/./try.c:189:(.text+0x...): undefined reference to `crypto_aead_ascon128av12_esp32_timingleaks_encrypt'
try.c: /usr/bin/x86_64-linux-gnu-ld.bfd: .../supercop-data/hertz/amd64/try/c/clang_-march=native_-O3_-fwrapv_-Qunused-arguments_-fPIC_-fPIE_-gdwarf-4_-Wall/timingleaks/crypto_aead/ascon128av12/esp32/work/./try.c:300:(.text+0x...): undefined reference to `crypto_aead_ascon128av12_esp32_timingleaks_decrypt'
try.c: /usr/bin/x86_64-linux-gnu-ld.bfd: .../supercop-data/hertz/amd64/try/c/clang_-march=native_-O3_-fwrapv_-Qunused-arguments_-fPIC_-fPIE_-gdwarf-4_-Wall/timingleaks/crypto_aead/ascon128av12/esp32/work/./try.c:331:(.text+0x...): undefined reference to `crypto_aead_ascon128av12_esp32_timingleaks_decrypt'
try.c: /usr/bin/x86_64-linux-gnu-ld.bfd: .../supercop-data/hertz/amd64/try/c/clang_-march=native_-O3_-fwrapv_-Qunused-arguments_-fPIC_-fPIE_-gdwarf-4_-Wall/timingleaks/crypto_aead/ascon128av12/esp32/work/./try.c:476:(.text+0x...): undefined reference to `crypto_aead_ascon128av12_esp32_timingleaks_decrypt'
try.c: /usr/bin/x86_64-linux-gnu-ld.bfd: .../supercop-data/hertz/amd64/try/c/clang_-march=native_-O3_-fwrapv_-Qunused-arguments_-fPIC_-fPIE_-gdwarf-4_-Wall/timingleaks/crypto_aead/ascon128av12/esp32/work/./try.c:480:(.text+0x...): undefined reference to `crypto_aead_ascon128av12_esp32_timingleaks_decrypt'
try.c: /usr/bin/x86_64-linux-gnu-ld.bfd: .../supercop-data/hertz/amd64/try/c/clang_-march=native_-O3_-fwrapv_-Qunused-arguments_-fPIC_-fPIE_-gdwarf-4_-Wall/timingleaks/crypto_aead/ascon128av12/esp32/work/./try.c:484:(.text+0x...): undefined reference to `crypto_aead_ascon128av12_esp32_timingleaks_decrypt'
try.c: clang: error: linker command failed with exit code 1 (use -v to see invocation)

Number of similar (implementation,compiler) pairs: 1, namely:
ImplementationCompiler
T:esp32clang -march=native -O3 -fwrapv -Qunused-arguments -fPIC -fPIE -gdwarf-4 -Wall (Ubuntu_Clang_21.1.8_(6ubuntu1))

Compiler output


try.c: /usr/bin/x86_64-linux-gnu-ld.bfd: /tmp/try-small-3a8e2d.o: in function `doit':
try.c: .../supercop-data/hertz/amd64/try/c/clang_-march=native_-O_-fwrapv_-Qunused-arguments_-fPIC_-fPIE_-gdwarf-4_-Wall/timingleaks/crypto_aead/ascon128av12/esp32/work/./try.c:133:(.text+0x...): undefined reference to `crypto_aead_ascon128av12_esp32_timingleaks_encrypt'
try.c: /usr/bin/x86_64-linux-gnu-ld.bfd: .../supercop-data/hertz/amd64/try/c/clang_-march=native_-O_-fwrapv_-Qunused-arguments_-fPIC_-fPIE_-gdwarf-4_-Wall/timingleaks/crypto_aead/ascon128av12/esp32/work/./try.c:135:(.text+0x...): undefined reference to `crypto_aead_ascon128av12_esp32_timingleaks_decrypt'
try.c: /usr/bin/x86_64-linux-gnu-ld.bfd: /tmp/try-small-3a8e2d.o: in function `test':
try.c: .../supercop-data/hertz/amd64/try/c/clang_-march=native_-O_-fwrapv_-Qunused-arguments_-fPIC_-fPIE_-gdwarf-4_-Wall/timingleaks/crypto_aead/ascon128av12/esp32/work/./try.c:159:(.text+0x...): undefined reference to `crypto_aead_ascon128av12_esp32_timingleaks_encrypt'
try.c: /usr/bin/x86_64-linux-gnu-ld.bfd: .../supercop-data/hertz/amd64/try/c/clang_-march=native_-O_-fwrapv_-Qunused-arguments_-fPIC_-fPIE_-gdwarf-4_-Wall/timingleaks/crypto_aead/ascon128av12/esp32/work/./try.c:189:(.text+0x...): undefined reference to `crypto_aead_ascon128av12_esp32_timingleaks_encrypt'
try.c: /usr/bin/x86_64-linux-gnu-ld.bfd: .../supercop-data/hertz/amd64/try/c/clang_-march=native_-O_-fwrapv_-Qunused-arguments_-fPIC_-fPIE_-gdwarf-4_-Wall/timingleaks/crypto_aead/ascon128av12/esp32/work/./try.c:300:(.text+0x...): undefined reference to `crypto_aead_ascon128av12_esp32_timingleaks_decrypt'
try.c: /usr/bin/x86_64-linux-gnu-ld.bfd: .../supercop-data/hertz/amd64/try/c/clang_-march=native_-O_-fwrapv_-Qunused-arguments_-fPIC_-fPIE_-gdwarf-4_-Wall/timingleaks/crypto_aead/ascon128av12/esp32/work/./try.c:331:(.text+0x...): undefined reference to `crypto_aead_ascon128av12_esp32_timingleaks_decrypt'
try.c: /usr/bin/x86_64-linux-gnu-ld.bfd: .../supercop-data/hertz/amd64/try/c/clang_-march=native_-O_-fwrapv_-Qunused-arguments_-fPIC_-fPIE_-gdwarf-4_-Wall/timingleaks/crypto_aead/ascon128av12/esp32/work/./try.c:476:(.text+0x...): undefined reference to `crypto_aead_ascon128av12_esp32_timingleaks_decrypt'
try.c: /usr/bin/x86_64-linux-gnu-ld.bfd: .../supercop-data/hertz/amd64/try/c/clang_-march=native_-O_-fwrapv_-Qunused-arguments_-fPIC_-fPIE_-gdwarf-4_-Wall/timingleaks/crypto_aead/ascon128av12/esp32/work/./try.c:480:(.text+0x...): undefined reference to `crypto_aead_ascon128av12_esp32_timingleaks_decrypt'
try.c: /usr/bin/x86_64-linux-gnu-ld.bfd: .../supercop-data/hertz/amd64/try/c/clang_-march=native_-O_-fwrapv_-Qunused-arguments_-fPIC_-fPIE_-gdwarf-4_-Wall/timingleaks/crypto_aead/ascon128av12/esp32/work/./try.c:484:(.text+0x...): undefined reference to `crypto_aead_ascon128av12_esp32_timingleaks_decrypt'
try.c: clang: error: linker command failed with exit code 1 (use -v to see invocation)

Number of similar (implementation,compiler) pairs: 1, namely:
ImplementationCompiler
T:esp32clang -march=native -O -fwrapv -Qunused-arguments -fPIC -fPIE -gdwarf-4 -Wall (Ubuntu_Clang_21.1.8_(6ubuntu1))

Compiler output


try.c: /usr/bin/x86_64-linux-gnu-ld.bfd: /tmp/try-small-13fa24.o: in function `doit':
try.c: .../supercop-data/hertz/amd64/try/c/clang_-march=native_-Os_-fwrapv_-Qunused-arguments_-fPIC_-fPIE_-gdwarf-4_-Wall/timingleaks/crypto_aead/ascon128av12/esp32/work/./try.c:133:(.text+0x...): undefined reference to `crypto_aead_ascon128av12_esp32_timingleaks_encrypt'
try.c: /usr/bin/x86_64-linux-gnu-ld.bfd: .../supercop-data/hertz/amd64/try/c/clang_-march=native_-Os_-fwrapv_-Qunused-arguments_-fPIC_-fPIE_-gdwarf-4_-Wall/timingleaks/crypto_aead/ascon128av12/esp32/work/./try.c:135:(.text+0x...): undefined reference to `crypto_aead_ascon128av12_esp32_timingleaks_decrypt'
try.c: /usr/bin/x86_64-linux-gnu-ld.bfd: /tmp/try-small-13fa24.o: in function `test':
try.c: .../supercop-data/hertz/amd64/try/c/clang_-march=native_-Os_-fwrapv_-Qunused-arguments_-fPIC_-fPIE_-gdwarf-4_-Wall/timingleaks/crypto_aead/ascon128av12/esp32/work/./try.c:159:(.text+0x...): undefined reference to `crypto_aead_ascon128av12_esp32_timingleaks_encrypt'
try.c: /usr/bin/x86_64-linux-gnu-ld.bfd: .../supercop-data/hertz/amd64/try/c/clang_-march=native_-Os_-fwrapv_-Qunused-arguments_-fPIC_-fPIE_-gdwarf-4_-Wall/timingleaks/crypto_aead/ascon128av12/esp32/work/./try.c:189:(.text+0x...): undefined reference to `crypto_aead_ascon128av12_esp32_timingleaks_encrypt'
try.c: /usr/bin/x86_64-linux-gnu-ld.bfd: .../supercop-data/hertz/amd64/try/c/clang_-march=native_-Os_-fwrapv_-Qunused-arguments_-fPIC_-fPIE_-gdwarf-4_-Wall/timingleaks/crypto_aead/ascon128av12/esp32/work/./try.c:300:(.text+0x...): undefined reference to `crypto_aead_ascon128av12_esp32_timingleaks_decrypt'
try.c: /usr/bin/x86_64-linux-gnu-ld.bfd: .../supercop-data/hertz/amd64/try/c/clang_-march=native_-Os_-fwrapv_-Qunused-arguments_-fPIC_-fPIE_-gdwarf-4_-Wall/timingleaks/crypto_aead/ascon128av12/esp32/work/./try.c:331:(.text+0x...): undefined reference to `crypto_aead_ascon128av12_esp32_timingleaks_decrypt'
try.c: /usr/bin/x86_64-linux-gnu-ld.bfd: .../supercop-data/hertz/amd64/try/c/clang_-march=native_-Os_-fwrapv_-Qunused-arguments_-fPIC_-fPIE_-gdwarf-4_-Wall/timingleaks/crypto_aead/ascon128av12/esp32/work/./try.c:476:(.text+0x...): undefined reference to `crypto_aead_ascon128av12_esp32_timingleaks_decrypt'
try.c: /usr/bin/x86_64-linux-gnu-ld.bfd: .../supercop-data/hertz/amd64/try/c/clang_-march=native_-Os_-fwrapv_-Qunused-arguments_-fPIC_-fPIE_-gdwarf-4_-Wall/timingleaks/crypto_aead/ascon128av12/esp32/work/./try.c:480:(.text+0x...): undefined reference to `crypto_aead_ascon128av12_esp32_timingleaks_decrypt'
try.c: /usr/bin/x86_64-linux-gnu-ld.bfd: .../supercop-data/hertz/amd64/try/c/clang_-march=native_-Os_-fwrapv_-Qunused-arguments_-fPIC_-fPIE_-gdwarf-4_-Wall/timingleaks/crypto_aead/ascon128av12/esp32/work/./try.c:484:(.text+0x...): undefined reference to `crypto_aead_ascon128av12_esp32_timingleaks_decrypt'
try.c: clang: error: linker command failed with exit code 1 (use -v to see invocation)

Number of similar (implementation,compiler) pairs: 1, namely:
ImplementationCompiler
T:esp32clang -march=native -Os -fwrapv -Qunused-arguments -fPIC -fPIE -gdwarf-4 -Wall (Ubuntu_Clang_21.1.8_(6ubuntu1))

Compiler output


try.c: /usr/bin/x86_64-linux-gnu-ld.bfd: /tmp/ccZRRJHK.o: in function `doit':
try.c: .../supercop-data/hertz/amd64/try/c/gcc_-march=native_-mtune=native_-O2_-fwrapv_-fPIC_-fPIE_-gdwarf-4_-Wall/timingleaks/crypto_aead/ascon128av12/esp32/work/try.c:133:(.text+0x...): undefined reference to `crypto_aead_ascon128av12_esp32_timingleaks_encrypt'
try.c: /usr/bin/x86_64-linux-gnu-ld.bfd: .../supercop-data/hertz/amd64/try/c/gcc_-march=native_-mtune=native_-O2_-fwrapv_-fPIC_-fPIE_-gdwarf-4_-Wall/timingleaks/crypto_aead/ascon128av12/esp32/work/try.c:135:(.text+0x...): undefined reference to `crypto_aead_ascon128av12_esp32_timingleaks_decrypt'
try.c: /usr/bin/x86_64-linux-gnu-ld.bfd: /tmp/ccZRRJHK.o: in function `test':
try.c: .../supercop-data/hertz/amd64/try/c/gcc_-march=native_-mtune=native_-O2_-fwrapv_-fPIC_-fPIE_-gdwarf-4_-Wall/timingleaks/crypto_aead/ascon128av12/esp32/work/try.c:189:(.text+0x...): undefined reference to `crypto_aead_ascon128av12_esp32_timingleaks_encrypt'
try.c: /usr/bin/x86_64-linux-gnu-ld.bfd: .../supercop-data/hertz/amd64/try/c/gcc_-march=native_-mtune=native_-O2_-fwrapv_-fPIC_-fPIE_-gdwarf-4_-Wall/timingleaks/crypto_aead/ascon128av12/esp32/work/try.c:300:(.text+0x...): undefined reference to `crypto_aead_ascon128av12_esp32_timingleaks_decrypt'
try.c: /usr/bin/x86_64-linux-gnu-ld.bfd: .../supercop-data/hertz/amd64/try/c/gcc_-march=native_-mtune=native_-O2_-fwrapv_-fPIC_-fPIE_-gdwarf-4_-Wall/timingleaks/crypto_aead/ascon128av12/esp32/work/try.c:331:(.text+0x...): undefined reference to `crypto_aead_ascon128av12_esp32_timingleaks_decrypt'
try.c: /usr/bin/x86_64-linux-gnu-ld.bfd: .../supercop-data/hertz/amd64/try/c/gcc_-march=native_-mtune=native_-O2_-fwrapv_-fPIC_-fPIE_-gdwarf-4_-Wall/timingleaks/crypto_aead/ascon128av12/esp32/work/try.c:476:(.text+0x...): undefined reference to `crypto_aead_ascon128av12_esp32_timingleaks_decrypt'
try.c: /usr/bin/x86_64-linux-gnu-ld.bfd: .../supercop-data/hertz/amd64/try/c/gcc_-march=native_-mtune=native_-O2_-fwrapv_-fPIC_-fPIE_-gdwarf-4_-Wall/timingleaks/crypto_aead/ascon128av12/esp32/work/try.c:480:(.text+0x...): undefined reference to `crypto_aead_ascon128av12_esp32_timingleaks_decrypt'
try.c: /usr/bin/x86_64-linux-gnu-ld.bfd: .../supercop-data/hertz/amd64/try/c/gcc_-march=native_-mtune=native_-O2_-fwrapv_-fPIC_-fPIE_-gdwarf-4_-Wall/timingleaks/crypto_aead/ascon128av12/esp32/work/try.c:484:(.text+0x...): undefined reference to `crypto_aead_ascon128av12_esp32_timingleaks_decrypt'
try.c: /usr/bin/x86_64-linux-gnu-ld.bfd: .../supercop-data/hertz/amd64/try/c/gcc_-march=native_-mtune=native_-O2_-fwrapv_-fPIC_-fPIE_-gdwarf-4_-Wall/timingleaks/crypto_aead/ascon128av12/esp32/work/try.c:159:(.text+0x...): undefined reference to `crypto_aead_ascon128av12_esp32_timingleaks_encrypt'
try.c: collect2: error: ld returned 1 exit status

Number of similar (implementation,compiler) pairs: 1, namely:
ImplementationCompiler
T:esp32gcc -march=native -mtune=native -O2 -fwrapv -fPIC -fPIE -gdwarf-4 -Wall (15.2.0)

Compiler output


try.c: /usr/bin/x86_64-linux-gnu-ld.bfd: /tmp/ccRQ9LCz.o: in function `doit':
try.c: .../supercop-data/hertz/amd64/try/c/gcc_-march=native_-mtune=native_-O3_-fwrapv_-fPIC_-fPIE_-gdwarf-4_-Wall/timingleaks/crypto_aead/ascon128av12/esp32/work/try.c:133:(.text+0x...): undefined reference to `crypto_aead_ascon128av12_esp32_timingleaks_encrypt'
try.c: /usr/bin/x86_64-linux-gnu-ld.bfd: .../supercop-data/hertz/amd64/try/c/gcc_-march=native_-mtune=native_-O3_-fwrapv_-fPIC_-fPIE_-gdwarf-4_-Wall/timingleaks/crypto_aead/ascon128av12/esp32/work/try.c:135:(.text+0x...): undefined reference to `crypto_aead_ascon128av12_esp32_timingleaks_decrypt'
try.c: /usr/bin/x86_64-linux-gnu-ld.bfd: /tmp/ccRQ9LCz.o: in function `test':
try.c: .../supercop-data/hertz/amd64/try/c/gcc_-march=native_-mtune=native_-O3_-fwrapv_-fPIC_-fPIE_-gdwarf-4_-Wall/timingleaks/crypto_aead/ascon128av12/esp32/work/try.c:189:(.text+0x...): undefined reference to `crypto_aead_ascon128av12_esp32_timingleaks_encrypt'
try.c: /usr/bin/x86_64-linux-gnu-ld.bfd: .../supercop-data/hertz/amd64/try/c/gcc_-march=native_-mtune=native_-O3_-fwrapv_-fPIC_-fPIE_-gdwarf-4_-Wall/timingleaks/crypto_aead/ascon128av12/esp32/work/try.c:300:(.text+0x...): undefined reference to `crypto_aead_ascon128av12_esp32_timingleaks_decrypt'
try.c: /usr/bin/x86_64-linux-gnu-ld.bfd: .../supercop-data/hertz/amd64/try/c/gcc_-march=native_-mtune=native_-O3_-fwrapv_-fPIC_-fPIE_-gdwarf-4_-Wall/timingleaks/crypto_aead/ascon128av12/esp32/work/try.c:331:(.text+0x...): undefined reference to `crypto_aead_ascon128av12_esp32_timingleaks_decrypt'
try.c: /usr/bin/x86_64-linux-gnu-ld.bfd: .../supercop-data/hertz/amd64/try/c/gcc_-march=native_-mtune=native_-O3_-fwrapv_-fPIC_-fPIE_-gdwarf-4_-Wall/timingleaks/crypto_aead/ascon128av12/esp32/work/try.c:476:(.text+0x...): undefined reference to `crypto_aead_ascon128av12_esp32_timingleaks_decrypt'
try.c: /usr/bin/x86_64-linux-gnu-ld.bfd: .../supercop-data/hertz/amd64/try/c/gcc_-march=native_-mtune=native_-O3_-fwrapv_-fPIC_-fPIE_-gdwarf-4_-Wall/timingleaks/crypto_aead/ascon128av12/esp32/work/try.c:480:(.text+0x...): undefined reference to `crypto_aead_ascon128av12_esp32_timingleaks_decrypt'
try.c: /usr/bin/x86_64-linux-gnu-ld.bfd: .../supercop-data/hertz/amd64/try/c/gcc_-march=native_-mtune=native_-O3_-fwrapv_-fPIC_-fPIE_-gdwarf-4_-Wall/timingleaks/crypto_aead/ascon128av12/esp32/work/try.c:484:(.text+0x...): undefined reference to `crypto_aead_ascon128av12_esp32_timingleaks_decrypt'
try.c: /usr/bin/x86_64-linux-gnu-ld.bfd: .../supercop-data/hertz/amd64/try/c/gcc_-march=native_-mtune=native_-O3_-fwrapv_-fPIC_-fPIE_-gdwarf-4_-Wall/timingleaks/crypto_aead/ascon128av12/esp32/work/try.c:159:(.text+0x...): undefined reference to `crypto_aead_ascon128av12_esp32_timingleaks_encrypt'
try.c: collect2: error: ld returned 1 exit status

Number of similar (implementation,compiler) pairs: 1, namely:
ImplementationCompiler
T:esp32gcc -march=native -mtune=native -O3 -fwrapv -fPIC -fPIE -gdwarf-4 -Wall (15.2.0)

Compiler output


try.c: /usr/bin/x86_64-linux-gnu-ld.bfd: /tmp/cc6pNZWU.o: in function `doit':
try.c: .../supercop-data/hertz/amd64/try/c/gcc_-march=native_-mtune=native_-O_-fwrapv_-fPIC_-fPIE_-gdwarf-4_-Wall/timingleaks/crypto_aead/ascon128av12/esp32/work/try.c:133:(.text+0x...): undefined reference to `crypto_aead_ascon128av12_esp32_timingleaks_encrypt'
try.c: /usr/bin/x86_64-linux-gnu-ld.bfd: .../supercop-data/hertz/amd64/try/c/gcc_-march=native_-mtune=native_-O_-fwrapv_-fPIC_-fPIE_-gdwarf-4_-Wall/timingleaks/crypto_aead/ascon128av12/esp32/work/try.c:135:(.text+0x...): undefined reference to `crypto_aead_ascon128av12_esp32_timingleaks_decrypt'
try.c: /usr/bin/x86_64-linux-gnu-ld.bfd: /tmp/cc6pNZWU.o: in function `test':
try.c: .../supercop-data/hertz/amd64/try/c/gcc_-march=native_-mtune=native_-O_-fwrapv_-fPIC_-fPIE_-gdwarf-4_-Wall/timingleaks/crypto_aead/ascon128av12/esp32/work/try.c:159:(.text+0x...): undefined reference to `crypto_aead_ascon128av12_esp32_timingleaks_encrypt'
try.c: /usr/bin/x86_64-linux-gnu-ld.bfd: .../supercop-data/hertz/amd64/try/c/gcc_-march=native_-mtune=native_-O_-fwrapv_-fPIC_-fPIE_-gdwarf-4_-Wall/timingleaks/crypto_aead/ascon128av12/esp32/work/try.c:189:(.text+0x...): undefined reference to `crypto_aead_ascon128av12_esp32_timingleaks_encrypt'
try.c: /usr/bin/x86_64-linux-gnu-ld.bfd: .../supercop-data/hertz/amd64/try/c/gcc_-march=native_-mtune=native_-O_-fwrapv_-fPIC_-fPIE_-gdwarf-4_-Wall/timingleaks/crypto_aead/ascon128av12/esp32/work/try.c:300:(.text+0x...): undefined reference to `crypto_aead_ascon128av12_esp32_timingleaks_decrypt'
try.c: /usr/bin/x86_64-linux-gnu-ld.bfd: .../supercop-data/hertz/amd64/try/c/gcc_-march=native_-mtune=native_-O_-fwrapv_-fPIC_-fPIE_-gdwarf-4_-Wall/timingleaks/crypto_aead/ascon128av12/esp32/work/try.c:331:(.text+0x...): undefined reference to `crypto_aead_ascon128av12_esp32_timingleaks_decrypt'
try.c: /usr/bin/x86_64-linux-gnu-ld.bfd: .../supercop-data/hertz/amd64/try/c/gcc_-march=native_-mtune=native_-O_-fwrapv_-fPIC_-fPIE_-gdwarf-4_-Wall/timingleaks/crypto_aead/ascon128av12/esp32/work/try.c:476:(.text+0x...): undefined reference to `crypto_aead_ascon128av12_esp32_timingleaks_decrypt'
try.c: /usr/bin/x86_64-linux-gnu-ld.bfd: .../supercop-data/hertz/amd64/try/c/gcc_-march=native_-mtune=native_-O_-fwrapv_-fPIC_-fPIE_-gdwarf-4_-Wall/timingleaks/crypto_aead/ascon128av12/esp32/work/try.c:480:(.text+0x...): undefined reference to `crypto_aead_ascon128av12_esp32_timingleaks_decrypt'
try.c: /usr/bin/x86_64-linux-gnu-ld.bfd: .../supercop-data/hertz/amd64/try/c/gcc_-march=native_-mtune=native_-O_-fwrapv_-fPIC_-fPIE_-gdwarf-4_-Wall/timingleaks/crypto_aead/ascon128av12/esp32/work/try.c:484:(.text+0x...): undefined reference to `crypto_aead_ascon128av12_esp32_timingleaks_decrypt'
try.c: collect2: error: ld returned 1 exit status

Number of similar (implementation,compiler) pairs: 1, namely:
ImplementationCompiler
T:esp32gcc -march=native -mtune=native -O -fwrapv -fPIC -fPIE -gdwarf-4 -Wall (15.2.0)

Compiler output


try.c: /usr/bin/x86_64-linux-gnu-ld.bfd: /tmp/ccs1Se0a.o: in function `doit':
try.c: .../supercop-data/hertz/amd64/try/c/gcc_-march=native_-mtune=native_-Os_-fwrapv_-fPIC_-fPIE_-gdwarf-4_-Wall/timingleaks/crypto_aead/ascon128av12/esp32/work/try.c:133:(.text+0x...): undefined reference to `crypto_aead_ascon128av12_esp32_timingleaks_encrypt'
try.c: /usr/bin/x86_64-linux-gnu-ld.bfd: .../supercop-data/hertz/amd64/try/c/gcc_-march=native_-mtune=native_-Os_-fwrapv_-fPIC_-fPIE_-gdwarf-4_-Wall/timingleaks/crypto_aead/ascon128av12/esp32/work/try.c:135:(.text+0x...): undefined reference to `crypto_aead_ascon128av12_esp32_timingleaks_decrypt'
try.c: /usr/bin/x86_64-linux-gnu-ld.bfd: /tmp/ccs1Se0a.o: in function `test':
try.c: .../supercop-data/hertz/amd64/try/c/gcc_-march=native_-mtune=native_-Os_-fwrapv_-fPIC_-fPIE_-gdwarf-4_-Wall/timingleaks/crypto_aead/ascon128av12/esp32/work/try.c:159:(.text+0x...): undefined reference to `crypto_aead_ascon128av12_esp32_timingleaks_encrypt'
try.c: /usr/bin/x86_64-linux-gnu-ld.bfd: .../supercop-data/hertz/amd64/try/c/gcc_-march=native_-mtune=native_-Os_-fwrapv_-fPIC_-fPIE_-gdwarf-4_-Wall/timingleaks/crypto_aead/ascon128av12/esp32/work/try.c:189:(.text+0x...): undefined reference to `crypto_aead_ascon128av12_esp32_timingleaks_encrypt'
try.c: /usr/bin/x86_64-linux-gnu-ld.bfd: .../supercop-data/hertz/amd64/try/c/gcc_-march=native_-mtune=native_-Os_-fwrapv_-fPIC_-fPIE_-gdwarf-4_-Wall/timingleaks/crypto_aead/ascon128av12/esp32/work/try.c:300:(.text+0x...): undefined reference to `crypto_aead_ascon128av12_esp32_timingleaks_decrypt'
try.c: /usr/bin/x86_64-linux-gnu-ld.bfd: .../supercop-data/hertz/amd64/try/c/gcc_-march=native_-mtune=native_-Os_-fwrapv_-fPIC_-fPIE_-gdwarf-4_-Wall/timingleaks/crypto_aead/ascon128av12/esp32/work/try.c:331:(.text+0x...): undefined reference to `crypto_aead_ascon128av12_esp32_timingleaks_decrypt'
try.c: /usr/bin/x86_64-linux-gnu-ld.bfd: .../supercop-data/hertz/amd64/try/c/gcc_-march=native_-mtune=native_-Os_-fwrapv_-fPIC_-fPIE_-gdwarf-4_-Wall/timingleaks/crypto_aead/ascon128av12/esp32/work/try.c:476:(.text+0x...): undefined reference to `crypto_aead_ascon128av12_esp32_timingleaks_decrypt'
try.c: /usr/bin/x86_64-linux-gnu-ld.bfd: .../supercop-data/hertz/amd64/try/c/gcc_-march=native_-mtune=native_-Os_-fwrapv_-fPIC_-fPIE_-gdwarf-4_-Wall/timingleaks/crypto_aead/ascon128av12/esp32/work/try.c:480:(.text+0x...): undefined reference to `crypto_aead_ascon128av12_esp32_timingleaks_decrypt'
try.c: /usr/bin/x86_64-linux-gnu-ld.bfd: .../supercop-data/hertz/amd64/try/c/gcc_-march=native_-mtune=native_-Os_-fwrapv_-fPIC_-fPIE_-gdwarf-4_-Wall/timingleaks/crypto_aead/ascon128av12/esp32/work/try.c:484:(.text+0x...): undefined reference to `crypto_aead_ascon128av12_esp32_timingleaks_decrypt'
try.c: collect2: error: ld returned 1 exit status

Number of similar (implementation,compiler) pairs: 1, namely:
ImplementationCompiler
T:esp32gcc -march=native -mtune=native -Os -fwrapv -fPIC -fPIE -gdwarf-4 -Wall (15.2.0)

Compiler output


aead.c: In file included from round.h:8,
aead.c:                  from permutations.h:11,
aead.c:                  from aead.c:5:
aead.c: In function 'memxor',
aead.c:     inlined from 'ascon_final' at aead.c:136:3:
aead.c: word.h:102:12: warning: writing 1 byte into a region of size 0 [-Wstringop-overflow=]
aead.c:   102 |     *dst++ ^= *src++;
aead.c:       |            ^~
aead.c: aead.c: In function 'ascon_final':
aead.c: aead.c:134:45: note: at offset 24 into destination object 's' of size [0, 24]
aead.c:   134 | forceinline void ascon_final(ascon_state_t* s, const ascon_key_t* key) {
aead.c:       |                              ~~~~~~~~~~~~~~~^
aead.c: In function 'memxor',
aead.c:     inlined from 'ascon_final' at aead.c:136:3:
aead.c: word.h:102:12: warning: writing 1 byte into a region of size 0 [-Wstringop-overflow=]
aead.c:   102 |     *dst++ ^= *src++;
aead.c:       |            ^~
aead.c: aead.c: In function 'ascon_final':
aead.c: aead.c:134:45: note: at offset 25 into destination object 's' of size [0, 24]
aead.c:   134 | forceinline void ascon_final(ascon_state_t* s, const ascon_key_t* key) {
aead.c:       |                              ~~~~~~~~~~~~~~~^
aead.c: In function 'memxor',
aead.c:     inlined from 'ascon_final' at aead.c:136:3:
aead.c: word.h:102:12: warning: writing 1 byte into a region of size 0 [-Wstringop-overflow=]
aead.c:   102 |     *dst++ ^= *src++;
aead.c: ...

Number of similar (implementation,compiler) pairs: 1, namely:
ImplementationCompiler
opt8gcc -march=native -mtune=native -O3 -fwrapv -fPIC -fPIE -gdwarf-4 -Wall (15.2.0)

Compiler output


aead.c: In file included from round.h:8,
aead.c:                  from permutations.h:11,
aead.c:                  from aead.c:5:
aead.c: In function 'memxor',
aead.c:     inlined from 'ascon_final' at aead.c:51:3:
aead.c: word.h:102:12: warning: writing 1 byte into a region of size 0 [-Wstringop-overflow=]
aead.c:   102 |     *dst++ ^= *src++;
aead.c:       |            ^~
aead.c: aead.c: In function 'ascon_final':
aead.c: aead.c:49:45: note: at offset 24 into destination object 's' of size [0, 24]
aead.c:    49 | forceinline void ascon_final(ascon_state_t* s, const ascon_key_t* key) {
aead.c:       |                              ~~~~~~~~~~~~~~~^
aead.c: In function 'memxor',
aead.c:     inlined from 'ascon_final' at aead.c:51:3:
aead.c: word.h:102:12: warning: writing 1 byte into a region of size 0 [-Wstringop-overflow=]
aead.c:   102 |     *dst++ ^= *src++;
aead.c:       |            ^~
aead.c: aead.c: In function 'ascon_final':
aead.c: aead.c:49:45: note: at offset 25 into destination object 's' of size [0, 24]
aead.c:    49 | forceinline void ascon_final(ascon_state_t* s, const ascon_key_t* key) {
aead.c:       |                              ~~~~~~~~~~~~~~~^
aead.c: In function 'memxor',
aead.c:     inlined from 'ascon_final' at aead.c:51:3:
aead.c: word.h:102:12: warning: writing 1 byte into a region of size 0 [-Wstringop-overflow=]
aead.c:   102 |     *dst++ ^= *src++;
aead.c: ...

Number of similar (implementation,compiler) pairs: 1, namely:
ImplementationCompiler
opt8_lowsizegcc -march=native -mtune=native -O3 -fwrapv -fPIC -fPIE -gdwarf-4 -Wall (15.2.0)

Namespace violations


constants.o constants R
interleave.o B R
permutations.o P12 T
permutations.o P8 T

Number of similar (implementation,compiler) pairs: 8, namely:
ImplementationCompiler
bi32clang -march=native -O2 -fwrapv -Qunused-arguments -fPIC -fPIE -gdwarf-4 -Wall (Ubuntu_Clang_21.1.8_(6ubuntu1))
bi32clang -march=native -O3 -fwrapv -Qunused-arguments -fPIC -fPIE -gdwarf-4 -Wall (Ubuntu_Clang_21.1.8_(6ubuntu1))
bi32clang -march=native -O -fwrapv -Qunused-arguments -fPIC -fPIE -gdwarf-4 -Wall (Ubuntu_Clang_21.1.8_(6ubuntu1))
bi32clang -march=native -Os -fwrapv -Qunused-arguments -fPIC -fPIE -gdwarf-4 -Wall (Ubuntu_Clang_21.1.8_(6ubuntu1))
bi32gcc -march=native -mtune=native -O2 -fwrapv -fPIC -fPIE -gdwarf-4 -Wall (15.2.0)
bi32gcc -march=native -mtune=native -O3 -fwrapv -fPIC -fPIE -gdwarf-4 -Wall (15.2.0)
bi32gcc -march=native -mtune=native -O -fwrapv -fPIC -fPIE -gdwarf-4 -Wall (15.2.0)
bi32gcc -march=native -mtune=native -Os -fwrapv -fPIC -fPIE -gdwarf-4 -Wall (15.2.0)

Namespace violations


aead.o ascon_adata T
aead.o ascon_decrypt T
aead.o ascon_encrypt T
aead.o ascon_final T
aead.o ascon_initaead T
aead.o ascon_loadkey T
constants.o constants R
interleave.o B R

Number of similar (implementation,compiler) pairs: 8, namely:
ImplementationCompiler
bi32_lowregclang -march=native -O2 -fwrapv -Qunused-arguments -fPIC -fPIE -gdwarf-4 -Wall (Ubuntu_Clang_21.1.8_(6ubuntu1))
bi32_lowregclang -march=native -O3 -fwrapv -Qunused-arguments -fPIC -fPIE -gdwarf-4 -Wall (Ubuntu_Clang_21.1.8_(6ubuntu1))
bi32_lowregclang -march=native -O -fwrapv -Qunused-arguments -fPIC -fPIE -gdwarf-4 -Wall (Ubuntu_Clang_21.1.8_(6ubuntu1))
bi32_lowregclang -march=native -Os -fwrapv -Qunused-arguments -fPIC -fPIE -gdwarf-4 -Wall (Ubuntu_Clang_21.1.8_(6ubuntu1))
bi32_lowreggcc -march=native -mtune=native -O2 -fwrapv -fPIC -fPIE -gdwarf-4 -Wall (15.2.0)
bi32_lowreggcc -march=native -mtune=native -O3 -fwrapv -fPIC -fPIE -gdwarf-4 -Wall (15.2.0)
bi32_lowreggcc -march=native -mtune=native -O -fwrapv -fPIC -fPIE -gdwarf-4 -Wall (15.2.0)
bi32_lowreggcc -march=native -mtune=native -Os -fwrapv -fPIC -fPIE -gdwarf-4 -Wall (15.2.0)

Namespace violations


aead.o ascon_aead T
constants.o constants R
interleave.o B R
interleave.o FROMBI T
interleave.o TOBI T
permutations.o P T
update.o ascon_update T

Number of similar (implementation,compiler) pairs: 8, namely:
ImplementationCompiler
bi32_lowsizeclang -march=native -O2 -fwrapv -Qunused-arguments -fPIC -fPIE -gdwarf-4 -Wall (Ubuntu_Clang_21.1.8_(6ubuntu1))
bi32_lowsizeclang -march=native -O3 -fwrapv -Qunused-arguments -fPIC -fPIE -gdwarf-4 -Wall (Ubuntu_Clang_21.1.8_(6ubuntu1))
bi32_lowsizeclang -march=native -O -fwrapv -Qunused-arguments -fPIC -fPIE -gdwarf-4 -Wall (Ubuntu_Clang_21.1.8_(6ubuntu1))
bi32_lowsizeclang -march=native -Os -fwrapv -Qunused-arguments -fPIC -fPIE -gdwarf-4 -Wall (Ubuntu_Clang_21.1.8_(6ubuntu1))
bi32_lowsizegcc -march=native -mtune=native -O2 -fwrapv -fPIC -fPIE -gdwarf-4 -Wall (15.2.0)
bi32_lowsizegcc -march=native -mtune=native -O3 -fwrapv -fPIC -fPIE -gdwarf-4 -Wall (15.2.0)
bi32_lowsizegcc -march=native -mtune=native -O -fwrapv -fPIC -fPIE -gdwarf-4 -Wall (15.2.0)
bi32_lowsizegcc -march=native -mtune=native -Os -fwrapv -fPIC -fPIE -gdwarf-4 -Wall (15.2.0)

Namespace violations


constants.o constants R
interleave.o FROMBI T
interleave.o TOBI T
permutations.o P T

Number of similar (implementation,compiler) pairs: 8, namely:
ImplementationCompiler
bi8clang -march=native -O2 -fwrapv -Qunused-arguments -fPIC -fPIE -gdwarf-4 -Wall (Ubuntu_Clang_21.1.8_(6ubuntu1))
bi8clang -march=native -O3 -fwrapv -Qunused-arguments -fPIC -fPIE -gdwarf-4 -Wall (Ubuntu_Clang_21.1.8_(6ubuntu1))
bi8clang -march=native -O -fwrapv -Qunused-arguments -fPIC -fPIE -gdwarf-4 -Wall (Ubuntu_Clang_21.1.8_(6ubuntu1))
bi8clang -march=native -Os -fwrapv -Qunused-arguments -fPIC -fPIE -gdwarf-4 -Wall (Ubuntu_Clang_21.1.8_(6ubuntu1))
bi8gcc -march=native -mtune=native -O2 -fwrapv -fPIC -fPIE -gdwarf-4 -Wall (15.2.0)
bi8gcc -march=native -mtune=native -O3 -fwrapv -fPIC -fPIE -gdwarf-4 -Wall (15.2.0)
bi8gcc -march=native -mtune=native -O -fwrapv -fPIC -fPIE -gdwarf-4 -Wall (15.2.0)
bi8gcc -march=native -mtune=native -Os -fwrapv -fPIC -fPIE -gdwarf-4 -Wall (15.2.0)

Namespace violations


aead.o ascon_aead T
permutations.o P T
update.o ascon_update T

Number of similar (implementation,compiler) pairs: 16, namely:
ImplementationCompiler
opt32_lowsizeclang -march=native -O2 -fwrapv -Qunused-arguments -fPIC -fPIE -gdwarf-4 -Wall (Ubuntu_Clang_21.1.8_(6ubuntu1))
opt32_lowsizeclang -march=native -O3 -fwrapv -Qunused-arguments -fPIC -fPIE -gdwarf-4 -Wall (Ubuntu_Clang_21.1.8_(6ubuntu1))
opt32_lowsizeclang -march=native -O -fwrapv -Qunused-arguments -fPIC -fPIE -gdwarf-4 -Wall (Ubuntu_Clang_21.1.8_(6ubuntu1))
opt32_lowsizeclang -march=native -Os -fwrapv -Qunused-arguments -fPIC -fPIE -gdwarf-4 -Wall (Ubuntu_Clang_21.1.8_(6ubuntu1))
opt32_lowsizegcc -march=native -mtune=native -O2 -fwrapv -fPIC -fPIE -gdwarf-4 -Wall (15.2.0)
opt32_lowsizegcc -march=native -mtune=native -O3 -fwrapv -fPIC -fPIE -gdwarf-4 -Wall (15.2.0)
opt32_lowsizegcc -march=native -mtune=native -O -fwrapv -fPIC -fPIE -gdwarf-4 -Wall (15.2.0)
opt32_lowsizegcc -march=native -mtune=native -Os -fwrapv -fPIC -fPIE -gdwarf-4 -Wall (15.2.0)
opt64_lowsizeclang -march=native -O2 -fwrapv -Qunused-arguments -fPIC -fPIE -gdwarf-4 -Wall (Ubuntu_Clang_21.1.8_(6ubuntu1))
opt64_lowsizeclang -march=native -O3 -fwrapv -Qunused-arguments -fPIC -fPIE -gdwarf-4 -Wall (Ubuntu_Clang_21.1.8_(6ubuntu1))
opt64_lowsizeclang -march=native -O -fwrapv -Qunused-arguments -fPIC -fPIE -gdwarf-4 -Wall (Ubuntu_Clang_21.1.8_(6ubuntu1))
opt64_lowsizeclang -march=native -Os -fwrapv -Qunused-arguments -fPIC -fPIE -gdwarf-4 -Wall (Ubuntu_Clang_21.1.8_(6ubuntu1))
opt64_lowsizegcc -march=native -mtune=native -O2 -fwrapv -fPIC -fPIE -gdwarf-4 -Wall (15.2.0)
opt64_lowsizegcc -march=native -mtune=native -O3 -fwrapv -fPIC -fPIE -gdwarf-4 -Wall (15.2.0)
opt64_lowsizegcc -march=native -mtune=native -O -fwrapv -fPIC -fPIE -gdwarf-4 -Wall (15.2.0)
opt64_lowsizegcc -march=native -mtune=native -Os -fwrapv -fPIC -fPIE -gdwarf-4 -Wall (15.2.0)

Namespace violations


aead.o ascon_adata T
aead.o ascon_decrypt T
aead.o ascon_encrypt T
aead.o ascon_final T
aead.o ascon_initaead T
aead.o ascon_loadkey T
permutations.o P T

Number of similar (implementation,compiler) pairs: 8, namely:
ImplementationCompiler
opt8clang -march=native -O2 -fwrapv -Qunused-arguments -fPIC -fPIE -gdwarf-4 -Wall (Ubuntu_Clang_21.1.8_(6ubuntu1))
opt8clang -march=native -O3 -fwrapv -Qunused-arguments -fPIC -fPIE -gdwarf-4 -Wall (Ubuntu_Clang_21.1.8_(6ubuntu1))
opt8clang -march=native -O -fwrapv -Qunused-arguments -fPIC -fPIE -gdwarf-4 -Wall (Ubuntu_Clang_21.1.8_(6ubuntu1))
opt8clang -march=native -Os -fwrapv -Qunused-arguments -fPIC -fPIE -gdwarf-4 -Wall (Ubuntu_Clang_21.1.8_(6ubuntu1))
opt8gcc -march=native -mtune=native -O2 -fwrapv -fPIC -fPIE -gdwarf-4 -Wall (15.2.0)
opt8gcc -march=native -mtune=native -O3 -fwrapv -fPIC -fPIE -gdwarf-4 -Wall (15.2.0)
opt8gcc -march=native -mtune=native -O -fwrapv -fPIC -fPIE -gdwarf-4 -Wall (15.2.0)
opt8gcc -march=native -mtune=native -Os -fwrapv -fPIC -fPIE -gdwarf-4 -Wall (15.2.0)

Namespace violations


aead.o ascon_final T
aead.o ascon_initaead T
aead.o ascon_loadkey T
permutations.o P T
update.o ascon_update T

Number of similar (implementation,compiler) pairs: 8, namely:
ImplementationCompiler
opt8_lowsizeclang -march=native -O2 -fwrapv -Qunused-arguments -fPIC -fPIE -gdwarf-4 -Wall (Ubuntu_Clang_21.1.8_(6ubuntu1))
opt8_lowsizeclang -march=native -O3 -fwrapv -Qunused-arguments -fPIC -fPIE -gdwarf-4 -Wall (Ubuntu_Clang_21.1.8_(6ubuntu1))
opt8_lowsizeclang -march=native -O -fwrapv -Qunused-arguments -fPIC -fPIE -gdwarf-4 -Wall (Ubuntu_Clang_21.1.8_(6ubuntu1))
opt8_lowsizeclang -march=native -Os -fwrapv -Qunused-arguments -fPIC -fPIE -gdwarf-4 -Wall (Ubuntu_Clang_21.1.8_(6ubuntu1))
opt8_lowsizegcc -march=native -mtune=native -O2 -fwrapv -fPIC -fPIE -gdwarf-4 -Wall (15.2.0)
opt8_lowsizegcc -march=native -mtune=native -O3 -fwrapv -fPIC -fPIE -gdwarf-4 -Wall (15.2.0)
opt8_lowsizegcc -march=native -mtune=native -O -fwrapv -fPIC -fPIE -gdwarf-4 -Wall (15.2.0)
opt8_lowsizegcc -march=native -mtune=native -Os -fwrapv -fPIC -fPIE -gdwarf-4 -Wall (15.2.0)

TIMECOP error (can be valgrind bug)


error 132

Process terminating with default action of signal 4 (SIGILL)
 Illegal opcode at address 0x4009318
   at 0x...: memset (string_fortified.h:59)
   by 0x...: cpucycles_works (wrapper.c:59)
   by 0x...: supercop_cpucycles_ticks_amd64_tsc_setup (amd64-tsc.c:28)
   by 0x...: cpucycles_init (wrapper.c:314)
   by 0x...: main (try-anything.c:330)
Illegal instruction (core dumped)

Number of similar (implementation,compiler) pairs: 1, namely:
ImplementationCompiler
bi32clang -march=native -O2 -fwrapv -Qunused-arguments -fPIC -fPIE -gdwarf-4 -Wall (Ubuntu_Clang_21.1.8_(6ubuntu1))

TIMECOP error (can be valgrind bug)


error 132

Process terminating with default action of signal 4 (SIGILL)
 Illegal opcode at address 0x40094D8
   at 0x...: memset (string_fortified.h:59)
   by 0x...: cpucycles_works (wrapper.c:59)
   by 0x...: supercop_cpucycles_ticks_amd64_tsc_setup (amd64-tsc.c:28)
   by 0x...: cpucycles_init (wrapper.c:314)
   by 0x...: main (try-anything.c:330)
Illegal instruction (core dumped)

Number of similar (implementation,compiler) pairs: 1, namely:
ImplementationCompiler
bi32clang -march=native -O3 -fwrapv -Qunused-arguments -fPIC -fPIE -gdwarf-4 -Wall (Ubuntu_Clang_21.1.8_(6ubuntu1))

TIMECOP error (can be valgrind bug)


error 132

Process terminating with default action of signal 4 (SIGILL)
 Illegal opcode at address 0x4008B98
   at 0x...: memset (string_fortified.h:59)
   by 0x...: cpucycles_works (wrapper.c:59)
   by 0x...: supercop_cpucycles_ticks_amd64_tsc_setup (amd64-tsc.c:28)
   by 0x...: cpucycles_init (wrapper.c:314)
   by 0x...: main (try-anything.c:330)
Illegal instruction (core dumped)

Number of similar (implementation,compiler) pairs: 1, namely:
ImplementationCompiler
bi32clang -march=native -O -fwrapv -Qunused-arguments -fPIC -fPIE -gdwarf-4 -Wall (Ubuntu_Clang_21.1.8_(6ubuntu1))

TIMECOP error (can be valgrind bug)


error 132

Process terminating with default action of signal 4 (SIGILL)
 Illegal opcode at address 0x4008A98
   at 0x...: memset (string_fortified.h:59)
   by 0x...: cpucycles_works (wrapper.c:59)
   by 0x...: supercop_cpucycles_ticks_amd64_tsc_setup (amd64-tsc.c:28)
   by 0x...: cpucycles_init (wrapper.c:314)
   by 0x...: main (try-anything.c:330)
Illegal instruction (core dumped)

Number of similar (implementation,compiler) pairs: 1, namely:
ImplementationCompiler
bi32clang -march=native -Os -fwrapv -Qunused-arguments -fPIC -fPIE -gdwarf-4 -Wall (Ubuntu_Clang_21.1.8_(6ubuntu1))

TIMECOP error (can be valgrind bug)


error 132

Process terminating with default action of signal 4 (SIGILL)
 Illegal opcode at address 0x4009698
   at 0x...: memset (string_fortified.h:59)
   by 0x...: cpucycles_works (wrapper.c:59)
   by 0x...: supercop_cpucycles_ticks_amd64_tsc_setup (amd64-tsc.c:28)
   by 0x...: cpucycles_init (wrapper.c:314)
   by 0x...: main (try-anything.c:330)
Illegal instruction (core dumped)

Number of similar (implementation,compiler) pairs: 1, namely:
ImplementationCompiler
bi32gcc -march=native -mtune=native -O2 -fwrapv -fPIC -fPIE -gdwarf-4 -Wall (15.2.0)

TIMECOP error (can be valgrind bug)


error 132

Process terminating with default action of signal 4 (SIGILL)
 Illegal opcode at address 0x4009B98
   at 0x...: memset (string_fortified.h:59)
   by 0x...: cpucycles_works (wrapper.c:59)
   by 0x...: supercop_cpucycles_ticks_amd64_tsc_setup (amd64-tsc.c:28)
   by 0x...: cpucycles_init (wrapper.c:314)
   by 0x...: main (try-anything.c:330)
Illegal instruction (core dumped)

Number of similar (implementation,compiler) pairs: 1, namely:
ImplementationCompiler
bi32gcc -march=native -mtune=native -O3 -fwrapv -fPIC -fPIE -gdwarf-4 -Wall (15.2.0)

TIMECOP error (can be valgrind bug)


error 132

Process terminating with default action of signal 4 (SIGILL)
 Illegal opcode at address 0x400A218
   at 0x...: memset (string_fortified.h:59)
   by 0x...: cpucycles_works (wrapper.c:59)
   by 0x...: supercop_cpucycles_ticks_amd64_tsc_setup (amd64-tsc.c:28)
   by 0x...: cpucycles_init (wrapper.c:314)
   by 0x...: main (try-anything.c:330)
Illegal instruction (core dumped)

Number of similar (implementation,compiler) pairs: 1, namely:
ImplementationCompiler
bi32gcc -march=native -mtune=native -O -fwrapv -fPIC -fPIE -gdwarf-4 -Wall (15.2.0)

TIMECOP error (can be valgrind bug)


error 132

Process terminating with default action of signal 4 (SIGILL)
 Illegal opcode at address 0x4008CD8
   at 0x...: memset (string_fortified.h:59)
   by 0x...: cpucycles_works (wrapper.c:59)
   by 0x...: supercop_cpucycles_ticks_amd64_tsc_setup (amd64-tsc.c:28)
   by 0x...: cpucycles_init (wrapper.c:314)
   by 0x...: main (try-anything.c:330)
Illegal instruction (core dumped)

Number of similar (implementation,compiler) pairs: 1, namely:
ImplementationCompiler
bi32gcc -march=native -mtune=native -Os -fwrapv -fPIC -fPIE -gdwarf-4 -Wall (15.2.0)

TIMECOP error (can be valgrind bug)


error 132

Process terminating with default action of signal 4 (SIGILL)
 Illegal opcode at address 0x4008118
   at 0x...: memset (string_fortified.h:59)
   by 0x...: cpucycles_works (wrapper.c:59)
   by 0x...: supercop_cpucycles_ticks_amd64_tsc_setup (amd64-tsc.c:28)
   by 0x...: cpucycles_init (wrapper.c:314)
   by 0x...: main (try-anything.c:330)
Illegal instruction (core dumped)

Number of similar (implementation,compiler) pairs: 1, namely:
ImplementationCompiler
bi32_lowregclang -march=native -O2 -fwrapv -Qunused-arguments -fPIC -fPIE -gdwarf-4 -Wall (Ubuntu_Clang_21.1.8_(6ubuntu1))

TIMECOP error (can be valgrind bug)


error 132

Process terminating with default action of signal 4 (SIGILL)
 Illegal opcode at address 0x40082D8
   at 0x...: memset (string_fortified.h:59)
   by 0x...: cpucycles_works (wrapper.c:59)
   by 0x...: supercop_cpucycles_ticks_amd64_tsc_setup (amd64-tsc.c:28)
   by 0x...: cpucycles_init (wrapper.c:314)
   by 0x...: main (try-anything.c:330)
Illegal instruction (core dumped)

Number of similar (implementation,compiler) pairs: 1, namely:
ImplementationCompiler
bi32_lowregclang -march=native -O3 -fwrapv -Qunused-arguments -fPIC -fPIE -gdwarf-4 -Wall (Ubuntu_Clang_21.1.8_(6ubuntu1))

TIMECOP error (can be valgrind bug)


error 132

Process terminating with default action of signal 4 (SIGILL)
 Illegal opcode at address 0x4007758
   at 0x...: memset (string_fortified.h:59)
   by 0x...: cpucycles_works (wrapper.c:59)
   by 0x...: supercop_cpucycles_ticks_amd64_tsc_setup (amd64-tsc.c:28)
   by 0x...: cpucycles_init (wrapper.c:314)
   by 0x...: main (try-anything.c:330)
Illegal instruction (core dumped)

Number of similar (implementation,compiler) pairs: 1, namely:
ImplementationCompiler
bi32_lowregclang -march=native -O -fwrapv -Qunused-arguments -fPIC -fPIE -gdwarf-4 -Wall (Ubuntu_Clang_21.1.8_(6ubuntu1))

TIMECOP error (can be valgrind bug)


error 132

Process terminating with default action of signal 4 (SIGILL)
 Illegal opcode at address 0x4007898
   at 0x...: memset (string_fortified.h:59)
   by 0x...: cpucycles_works (wrapper.c:59)
   by 0x...: supercop_cpucycles_ticks_amd64_tsc_setup (amd64-tsc.c:28)
   by 0x...: cpucycles_init (wrapper.c:314)
   by 0x...: main (try-anything.c:330)
Illegal instruction (core dumped)

Number of similar (implementation,compiler) pairs: 1, namely:
ImplementationCompiler
bi32_lowregclang -march=native -Os -fwrapv -Qunused-arguments -fPIC -fPIE -gdwarf-4 -Wall (Ubuntu_Clang_21.1.8_(6ubuntu1))

TIMECOP error (can be valgrind bug)


error 132

Process terminating with default action of signal 4 (SIGILL)
 Illegal opcode at address 0x4007E18
   at 0x...: memset (string_fortified.h:59)
   by 0x...: cpucycles_works (wrapper.c:59)
   by 0x...: supercop_cpucycles_ticks_amd64_tsc_setup (amd64-tsc.c:28)
   by 0x...: cpucycles_init (wrapper.c:314)
   by 0x...: main (try-anything.c:330)
Illegal instruction (core dumped)

Number of similar (implementation,compiler) pairs: 1, namely:
ImplementationCompiler
bi32_lowreggcc -march=native -mtune=native -O2 -fwrapv -fPIC -fPIE -gdwarf-4 -Wall (15.2.0)

TIMECOP error (can be valgrind bug)


error 132

Process terminating with default action of signal 4 (SIGILL)
 Illegal opcode at address 0x4008318
   at 0x...: memset (string_fortified.h:59)
   by 0x...: cpucycles_works (wrapper.c:59)
   by 0x...: supercop_cpucycles_ticks_amd64_tsc_setup (amd64-tsc.c:28)
   by 0x...: cpucycles_init (wrapper.c:314)
   by 0x...: main (try-anything.c:330)
Illegal instruction (core dumped)

Number of similar (implementation,compiler) pairs: 1, namely:
ImplementationCompiler
bi32_lowreggcc -march=native -mtune=native -O3 -fwrapv -fPIC -fPIE -gdwarf-4 -Wall (15.2.0)

TIMECOP error (can be valgrind bug)


error 132

Process terminating with default action of signal 4 (SIGILL)
 Illegal opcode at address 0x4008658
   at 0x...: memset (string_fortified.h:59)
   by 0x...: cpucycles_works (wrapper.c:59)
   by 0x...: supercop_cpucycles_ticks_amd64_tsc_setup (amd64-tsc.c:28)
   by 0x...: cpucycles_init (wrapper.c:314)
   by 0x...: main (try-anything.c:330)
Illegal instruction (core dumped)

Number of similar (implementation,compiler) pairs: 1, namely:
ImplementationCompiler
bi32_lowreggcc -march=native -mtune=native -O -fwrapv -fPIC -fPIE -gdwarf-4 -Wall (15.2.0)

TIMECOP error (can be valgrind bug)


error 132

Process terminating with default action of signal 4 (SIGILL)
 Illegal opcode at address 0x40073D8
   at 0x...: memset (string_fortified.h:59)
   by 0x...: cpucycles_works (wrapper.c:59)
   by 0x...: supercop_cpucycles_ticks_amd64_tsc_setup (amd64-tsc.c:28)
   by 0x...: cpucycles_init (wrapper.c:314)
   by 0x...: main (try-anything.c:330)
Illegal instruction (core dumped)

Number of similar (implementation,compiler) pairs: 2, namely:
ImplementationCompiler
bi32_lowreggcc -march=native -mtune=native -Os -fwrapv -fPIC -fPIE -gdwarf-4 -Wall (15.2.0)
opt8_lowsizegcc -march=native -mtune=native -O3 -fwrapv -fPIC -fPIE -gdwarf-4 -Wall (15.2.0)

TIMECOP error (can be valgrind bug)


error 132

Process terminating with default action of signal 4 (SIGILL)
 Illegal opcode at address 0x4006198
   at 0x...: memset (string_fortified.h:59)
   by 0x...: cpucycles_works (wrapper.c:59)
   by 0x...: supercop_cpucycles_ticks_amd64_tsc_setup (amd64-tsc.c:28)
   by 0x...: cpucycles_init (wrapper.c:314)
   by 0x...: main (try-anything.c:330)
Illegal instruction (core dumped)

Number of similar (implementation,compiler) pairs: 1, namely:
ImplementationCompiler
bi32_lowsizeclang -march=native -O2 -fwrapv -Qunused-arguments -fPIC -fPIE -gdwarf-4 -Wall (Ubuntu_Clang_21.1.8_(6ubuntu1))

TIMECOP error (can be valgrind bug)


error 132

Process terminating with default action of signal 4 (SIGILL)
 Illegal opcode at address 0x4006458
   at 0x...: memset (string_fortified.h:59)
   by 0x...: cpucycles_works (wrapper.c:59)
   by 0x...: supercop_cpucycles_ticks_amd64_tsc_setup (amd64-tsc.c:28)
   by 0x...: cpucycles_init (wrapper.c:314)
   by 0x...: main (try-anything.c:330)
Illegal instruction (core dumped)

Number of similar (implementation,compiler) pairs: 3, namely:
ImplementationCompiler
bi32_lowsizeclang -march=native -O3 -fwrapv -Qunused-arguments -fPIC -fPIE -gdwarf-4 -Wall (Ubuntu_Clang_21.1.8_(6ubuntu1))
opt8gcc -march=native -mtune=native -Os -fwrapv -fPIC -fPIE -gdwarf-4 -Wall (15.2.0)
opt8_lowsizegcc -march=native -mtune=native -O2 -fwrapv -fPIC -fPIE -gdwarf-4 -Wall (15.2.0)

TIMECOP error (can be valgrind bug)


error 132

Process terminating with default action of signal 4 (SIGILL)
 Illegal opcode at address 0x4005658
   at 0x...: memset (string_fortified.h:59)
   by 0x...: cpucycles_works (wrapper.c:59)
   by 0x...: supercop_cpucycles_ticks_amd64_tsc_setup (amd64-tsc.c:28)
   by 0x...: cpucycles_init (wrapper.c:314)
   by 0x...: main (try-anything.c:330)
Illegal instruction (core dumped)

Number of similar (implementation,compiler) pairs: 1, namely:
ImplementationCompiler
bi32_lowsizeclang -march=native -O -fwrapv -Qunused-arguments -fPIC -fPIE -gdwarf-4 -Wall (Ubuntu_Clang_21.1.8_(6ubuntu1))

TIMECOP error (can be valgrind bug)


error 132

Process terminating with default action of signal 4 (SIGILL)
 Illegal opcode at address 0x4005898
   at 0x...: memset (string_fortified.h:59)
   by 0x...: cpucycles_works (wrapper.c:59)
   by 0x...: supercop_cpucycles_ticks_amd64_tsc_setup (amd64-tsc.c:28)
   by 0x...: cpucycles_init (wrapper.c:314)
   by 0x...: main (try-anything.c:330)
Illegal instruction (core dumped)

Number of similar (implementation,compiler) pairs: 1, namely:
ImplementationCompiler
bi32_lowsizeclang -march=native -Os -fwrapv -Qunused-arguments -fPIC -fPIE -gdwarf-4 -Wall (Ubuntu_Clang_21.1.8_(6ubuntu1))

TIMECOP error (can be valgrind bug)


error 132

Process terminating with default action of signal 4 (SIGILL)
 Illegal opcode at address 0x4005E18
   at 0x...: memset (string_fortified.h:59)
   by 0x...: cpucycles_works (wrapper.c:59)
   by 0x...: supercop_cpucycles_ticks_amd64_tsc_setup (amd64-tsc.c:28)
   by 0x...: cpucycles_init (wrapper.c:314)
   by 0x...: main (try-anything.c:330)
Illegal instruction (core dumped)

Number of similar (implementation,compiler) pairs: 3, namely:
ImplementationCompiler
bi32_lowsizegcc -march=native -mtune=native -O2 -fwrapv -fPIC -fPIE -gdwarf-4 -Wall (15.2.0)
opt8clang -march=native -Os -fwrapv -Qunused-arguments -fPIC -fPIE -gdwarf-4 -Wall (Ubuntu_Clang_21.1.8_(6ubuntu1))
opt8_lowsizeclang -march=native -Os -fwrapv -Qunused-arguments -fPIC -fPIE -gdwarf-4 -Wall (Ubuntu_Clang_21.1.8_(6ubuntu1))

TIMECOP error (can be valgrind bug)


error 132

Process terminating with default action of signal 4 (SIGILL)
 Illegal opcode at address 0x4006418
   at 0x...: memset (string_fortified.h:59)
   by 0x...: cpucycles_works (wrapper.c:59)
   by 0x...: supercop_cpucycles_ticks_amd64_tsc_setup (amd64-tsc.c:28)
   by 0x...: cpucycles_init (wrapper.c:314)
   by 0x...: main (try-anything.c:330)
Illegal instruction (core dumped)

Number of similar (implementation,compiler) pairs: 2, namely:
ImplementationCompiler
bi32_lowsizegcc -march=native -mtune=native -O3 -fwrapv -fPIC -fPIE -gdwarf-4 -Wall (15.2.0)
opt8_lowsizegcc -march=native -mtune=native -Os -fwrapv -fPIC -fPIE -gdwarf-4 -Wall (15.2.0)

TIMECOP error (can be valgrind bug)


error 132

Process terminating with default action of signal 4 (SIGILL)
 Illegal opcode at address 0x4005C98
   at 0x...: memset (string_fortified.h:59)
   by 0x...: cpucycles_works (wrapper.c:59)
   by 0x...: supercop_cpucycles_ticks_amd64_tsc_setup (amd64-tsc.c:28)
   by 0x...: cpucycles_init (wrapper.c:314)
   by 0x...: main (try-anything.c:330)
Illegal instruction (core dumped)

Number of similar (implementation,compiler) pairs: 1, namely:
ImplementationCompiler
bi32_lowsizegcc -march=native -mtune=native -O -fwrapv -fPIC -fPIE -gdwarf-4 -Wall (15.2.0)

TIMECOP error (can be valgrind bug)


error 132

Process terminating with default action of signal 4 (SIGILL)
 Illegal opcode at address 0x4005618
   at 0x...: memset (string_fortified.h:59)
   by 0x...: cpucycles_works (wrapper.c:59)
   by 0x...: supercop_cpucycles_ticks_amd64_tsc_setup (amd64-tsc.c:28)
   by 0x...: cpucycles_init (wrapper.c:314)
   by 0x...: main (try-anything.c:330)
Illegal instruction (core dumped)

Number of similar (implementation,compiler) pairs: 1, namely:
ImplementationCompiler
bi32_lowsizegcc -march=native -mtune=native -Os -fwrapv -fPIC -fPIE -gdwarf-4 -Wall (15.2.0)

TIMECOP error (can be valgrind bug)


error 132

Process terminating with default action of signal 4 (SIGILL)
 Illegal opcode at address 0x4007858
   at 0x...: memset (string_fortified.h:59)
   by 0x...: cpucycles_works (wrapper.c:59)
   by 0x...: supercop_cpucycles_ticks_amd64_tsc_setup (amd64-tsc.c:28)
   by 0x...: cpucycles_init (wrapper.c:314)
   by 0x...: main (try-anything.c:330)
Illegal instruction (core dumped)

Number of similar (implementation,compiler) pairs: 1, namely:
ImplementationCompiler
bi8clang -march=native -O2 -fwrapv -Qunused-arguments -fPIC -fPIE -gdwarf-4 -Wall (Ubuntu_Clang_21.1.8_(6ubuntu1))

TIMECOP error (can be valgrind bug)


error 132

Process terminating with default action of signal 4 (SIGILL)
 Illegal opcode at address 0x4007A58
   at 0x...: memset (string_fortified.h:59)
   by 0x...: cpucycles_works (wrapper.c:59)
   by 0x...: supercop_cpucycles_ticks_amd64_tsc_setup (amd64-tsc.c:28)
   by 0x...: cpucycles_init (wrapper.c:314)
   by 0x...: main (try-anything.c:330)
Illegal instruction (core dumped)

Number of similar (implementation,compiler) pairs: 1, namely:
ImplementationCompiler
bi8clang -march=native -O3 -fwrapv -Qunused-arguments -fPIC -fPIE -gdwarf-4 -Wall (Ubuntu_Clang_21.1.8_(6ubuntu1))

TIMECOP error (can be valgrind bug)


error 132

Process terminating with default action of signal 4 (SIGILL)
 Illegal opcode at address 0x4007198
   at 0x...: memset (string_fortified.h:59)
   by 0x...: cpucycles_works (wrapper.c:59)
   by 0x...: supercop_cpucycles_ticks_amd64_tsc_setup (amd64-tsc.c:28)
   by 0x...: cpucycles_init (wrapper.c:314)
   by 0x...: main (try-anything.c:330)
Illegal instruction (core dumped)

Number of similar (implementation,compiler) pairs: 2, namely:
ImplementationCompiler
bi8clang -march=native -O -fwrapv -Qunused-arguments -fPIC -fPIE -gdwarf-4 -Wall (Ubuntu_Clang_21.1.8_(6ubuntu1))
refclang -march=native -Os -fwrapv -Qunused-arguments -fPIC -fPIE -gdwarf-4 -Wall (Ubuntu_Clang_21.1.8_(6ubuntu1))

TIMECOP error (can be valgrind bug)


error 132

Process terminating with default action of signal 4 (SIGILL)
 Illegal opcode at address 0x4006F98
   at 0x...: memset (string_fortified.h:59)
   by 0x...: cpucycles_works (wrapper.c:59)
   by 0x...: supercop_cpucycles_ticks_amd64_tsc_setup (amd64-tsc.c:28)
   by 0x...: cpucycles_init (wrapper.c:314)
   by 0x...: main (try-anything.c:330)
Illegal instruction (core dumped)

Number of similar (implementation,compiler) pairs: 1, namely:
ImplementationCompiler
bi8clang -march=native -Os -fwrapv -Qunused-arguments -fPIC -fPIE -gdwarf-4 -Wall (Ubuntu_Clang_21.1.8_(6ubuntu1))

TIMECOP error (can be valgrind bug)


error 132

Process terminating with default action of signal 4 (SIGILL)
 Illegal opcode at address 0x4007598
   at 0x...: memset (string_fortified.h:59)
   by 0x...: cpucycles_works (wrapper.c:59)
   by 0x...: supercop_cpucycles_ticks_amd64_tsc_setup (amd64-tsc.c:28)
   by 0x...: cpucycles_init (wrapper.c:314)
   by 0x...: main (try-anything.c:330)
Illegal instruction (core dumped)

Number of similar (implementation,compiler) pairs: 1, namely:
ImplementationCompiler
bi8gcc -march=native -mtune=native -O2 -fwrapv -fPIC -fPIE -gdwarf-4 -Wall (15.2.0)

TIMECOP error (can be valgrind bug)


error 132

Process terminating with default action of signal 4 (SIGILL)
 Illegal opcode at address 0x4007A98
   at 0x...: memset (string_fortified.h:59)
   by 0x...: cpucycles_works (wrapper.c:59)
   by 0x...: supercop_cpucycles_ticks_amd64_tsc_setup (amd64-tsc.c:28)
   by 0x...: cpucycles_init (wrapper.c:314)
   by 0x...: main (try-anything.c:330)
Illegal instruction (core dumped)

Number of similar (implementation,compiler) pairs: 1, namely:
ImplementationCompiler
bi8gcc -march=native -mtune=native -O3 -fwrapv -fPIC -fPIE -gdwarf-4 -Wall (15.2.0)

TIMECOP error (can be valgrind bug)


error 132

Process terminating with default action of signal 4 (SIGILL)
 Illegal opcode at address 0x4008AD8
   at 0x...: memset (string_fortified.h:59)
   by 0x...: cpucycles_works (wrapper.c:59)
   by 0x...: supercop_cpucycles_ticks_amd64_tsc_setup (amd64-tsc.c:28)
   by 0x...: cpucycles_init (wrapper.c:314)
   by 0x...: main (try-anything.c:330)
Illegal instruction (core dumped)

Number of similar (implementation,compiler) pairs: 1, namely:
ImplementationCompiler
bi8gcc -march=native -mtune=native -O -fwrapv -fPIC -fPIE -gdwarf-4 -Wall (15.2.0)

TIMECOP error (can be valgrind bug)


error 132

Process terminating with default action of signal 4 (SIGILL)
 Illegal opcode at address 0x4007318
   at 0x...: memset (string_fortified.h:59)
   by 0x...: cpucycles_works (wrapper.c:59)
   by 0x...: supercop_cpucycles_ticks_amd64_tsc_setup (amd64-tsc.c:28)
   by 0x...: cpucycles_init (wrapper.c:314)
   by 0x...: main (try-anything.c:330)
Illegal instruction (core dumped)

Number of similar (implementation,compiler) pairs: 1, namely:
ImplementationCompiler
bi8gcc -march=native -mtune=native -Os -fwrapv -fPIC -fPIE -gdwarf-4 -Wall (15.2.0)

TIMECOP error (can be valgrind bug)


error 132

Process terminating with default action of signal 4 (SIGILL)
 Illegal opcode at address 0x400AC98
   at 0x...: memset (string_fortified.h:59)
   by 0x...: cpucycles_works (wrapper.c:59)
   by 0x...: supercop_cpucycles_ticks_amd64_tsc_setup (amd64-tsc.c:28)
   by 0x...: cpucycles_init (wrapper.c:314)
   by 0x...: main (try-anything.c:330)
Illegal instruction (core dumped)

Number of similar (implementation,compiler) pairs: 1, namely:
ImplementationCompiler
opt32clang -march=native -O2 -fwrapv -Qunused-arguments -fPIC -fPIE -gdwarf-4 -Wall (Ubuntu_Clang_21.1.8_(6ubuntu1))

TIMECOP error (can be valgrind bug)


error 132

Process terminating with default action of signal 4 (SIGILL)
 Illegal opcode at address 0x400AE58
   at 0x...: memset (string_fortified.h:59)
   by 0x...: cpucycles_works (wrapper.c:59)
   by 0x...: supercop_cpucycles_ticks_amd64_tsc_setup (amd64-tsc.c:28)
   by 0x...: cpucycles_init (wrapper.c:314)
   by 0x...: main (try-anything.c:330)
Illegal instruction (core dumped)

Number of similar (implementation,compiler) pairs: 1, namely:
ImplementationCompiler
opt32clang -march=native -O3 -fwrapv -Qunused-arguments -fPIC -fPIE -gdwarf-4 -Wall (Ubuntu_Clang_21.1.8_(6ubuntu1))

TIMECOP error (can be valgrind bug)


error 132

Process terminating with default action of signal 4 (SIGILL)
 Illegal opcode at address 0x4009FD8
   at 0x...: memset (string_fortified.h:59)
   by 0x...: cpucycles_works (wrapper.c:59)
   by 0x...: supercop_cpucycles_ticks_amd64_tsc_setup (amd64-tsc.c:28)
   by 0x...: cpucycles_init (wrapper.c:314)
   by 0x...: main (try-anything.c:330)
Illegal instruction (core dumped)

Number of similar (implementation,compiler) pairs: 1, namely:
ImplementationCompiler
opt32clang -march=native -O -fwrapv -Qunused-arguments -fPIC -fPIE -gdwarf-4 -Wall (Ubuntu_Clang_21.1.8_(6ubuntu1))

TIMECOP error (can be valgrind bug)


error 132

Process terminating with default action of signal 4 (SIGILL)
 Illegal opcode at address 0x400A398
   at 0x...: memset (string_fortified.h:59)
   by 0x...: cpucycles_works (wrapper.c:59)
   by 0x...: supercop_cpucycles_ticks_amd64_tsc_setup (amd64-tsc.c:28)
   by 0x...: cpucycles_init (wrapper.c:314)
   by 0x...: main (try-anything.c:330)
Illegal instruction (core dumped)

Number of similar (implementation,compiler) pairs: 1, namely:
ImplementationCompiler
opt32clang -march=native -Os -fwrapv -Qunused-arguments -fPIC -fPIE -gdwarf-4 -Wall (Ubuntu_Clang_21.1.8_(6ubuntu1))

TIMECOP error (can be valgrind bug)


error 132

Process terminating with default action of signal 4 (SIGILL)
 Illegal opcode at address 0x400AF98
   at 0x...: memset (string_fortified.h:59)
   by 0x...: cpucycles_works (wrapper.c:59)
   by 0x...: supercop_cpucycles_ticks_amd64_tsc_setup (amd64-tsc.c:28)
   by 0x...: cpucycles_init (wrapper.c:314)
   by 0x...: main (try-anything.c:330)
Illegal instruction (core dumped)

Number of similar (implementation,compiler) pairs: 1, namely:
ImplementationCompiler
opt32gcc -march=native -mtune=native -O2 -fwrapv -fPIC -fPIE -gdwarf-4 -Wall (15.2.0)

TIMECOP error (can be valgrind bug)


error 132

Process terminating with default action of signal 4 (SIGILL)
 Illegal opcode at address 0x400B498
   at 0x...: memset (string_fortified.h:59)
   by 0x...: cpucycles_works (wrapper.c:59)
   by 0x...: supercop_cpucycles_ticks_amd64_tsc_setup (amd64-tsc.c:28)
   by 0x...: cpucycles_init (wrapper.c:314)
   by 0x...: main (try-anything.c:330)
Illegal instruction (core dumped)

Number of similar (implementation,compiler) pairs: 1, namely:
ImplementationCompiler
opt32gcc -march=native -mtune=native -O3 -fwrapv -fPIC -fPIE -gdwarf-4 -Wall (15.2.0)

TIMECOP error (can be valgrind bug)


error 132

Process terminating with default action of signal 4 (SIGILL)
 Illegal opcode at address 0x400BC98
   at 0x...: memset (string_fortified.h:59)
   by 0x...: cpucycles_works (wrapper.c:59)
   by 0x...: supercop_cpucycles_ticks_amd64_tsc_setup (amd64-tsc.c:28)
   by 0x...: cpucycles_init (wrapper.c:314)
   by 0x...: main (try-anything.c:330)
Illegal instruction (core dumped)

Number of similar (implementation,compiler) pairs: 1, namely:
ImplementationCompiler
opt32gcc -march=native -mtune=native -O -fwrapv -fPIC -fPIE -gdwarf-4 -Wall (15.2.0)

TIMECOP error (can be valgrind bug)


error 132

Process terminating with default action of signal 4 (SIGILL)
 Illegal opcode at address 0x400C7D8
   at 0x...: memset (string_fortified.h:59)
   by 0x...: cpucycles_works (wrapper.c:59)
   by 0x...: supercop_cpucycles_ticks_amd64_tsc_setup (amd64-tsc.c:28)
   by 0x...: cpucycles_init (wrapper.c:314)
   by 0x...: main (try-anything.c:330)
Illegal instruction (core dumped)

Number of similar (implementation,compiler) pairs: 1, namely:
ImplementationCompiler
opt32gcc -march=native -mtune=native -Os -fwrapv -fPIC -fPIE -gdwarf-4 -Wall (15.2.0)

TIMECOP error (can be valgrind bug)


error 132

Process terminating with default action of signal 4 (SIGILL)
 Illegal opcode at address 0x4006098
   at 0x...: memset (string_fortified.h:59)
   by 0x...: cpucycles_works (wrapper.c:59)
   by 0x...: supercop_cpucycles_ticks_amd64_tsc_setup (amd64-tsc.c:28)
   by 0x...: cpucycles_init (wrapper.c:314)
   by 0x...: main (try-anything.c:330)
Illegal instruction (core dumped)

Number of similar (implementation,compiler) pairs: 1, namely:
ImplementationCompiler
opt32_lowsizeclang -march=native -O2 -fwrapv -Qunused-arguments -fPIC -fPIE -gdwarf-4 -Wall (Ubuntu_Clang_21.1.8_(6ubuntu1))

TIMECOP error (can be valgrind bug)


error 132

Process terminating with default action of signal 4 (SIGILL)
 Illegal opcode at address 0x4006358
   at 0x...: memset (string_fortified.h:59)
   by 0x...: cpucycles_works (wrapper.c:59)
   by 0x...: supercop_cpucycles_ticks_amd64_tsc_setup (amd64-tsc.c:28)
   by 0x...: cpucycles_init (wrapper.c:314)
   by 0x...: main (try-anything.c:330)
Illegal instruction (core dumped)

Number of similar (implementation,compiler) pairs: 1, namely:
ImplementationCompiler
opt32_lowsizeclang -march=native -O3 -fwrapv -Qunused-arguments -fPIC -fPIE -gdwarf-4 -Wall (Ubuntu_Clang_21.1.8_(6ubuntu1))

TIMECOP error (can be valgrind bug)


error 132

Process terminating with default action of signal 4 (SIGILL)
 Illegal opcode at address 0x40053D8
   at 0x...: memset (string_fortified.h:59)
   by 0x...: cpucycles_works (wrapper.c:59)
   by 0x...: supercop_cpucycles_ticks_amd64_tsc_setup (amd64-tsc.c:28)
   by 0x...: cpucycles_init (wrapper.c:314)
   by 0x...: main (try-anything.c:330)
Illegal instruction (core dumped)

Number of similar (implementation,compiler) pairs: 1, namely:
ImplementationCompiler
opt32_lowsizeclang -march=native -O -fwrapv -Qunused-arguments -fPIC -fPIE -gdwarf-4 -Wall (Ubuntu_Clang_21.1.8_(6ubuntu1))

TIMECOP error (can be valgrind bug)


error 132

Process terminating with default action of signal 4 (SIGILL)
 Illegal opcode at address 0x40055D8
   at 0x...: memset (string_fortified.h:59)
   by 0x...: cpucycles_works (wrapper.c:59)
   by 0x...: supercop_cpucycles_ticks_amd64_tsc_setup (amd64-tsc.c:28)
   by 0x...: cpucycles_init (wrapper.c:314)
   by 0x...: main (try-anything.c:330)
Illegal instruction (core dumped)

Number of similar (implementation,compiler) pairs: 2, namely:
ImplementationCompiler
opt32_lowsizeclang -march=native -Os -fwrapv -Qunused-arguments -fPIC -fPIE -gdwarf-4 -Wall (Ubuntu_Clang_21.1.8_(6ubuntu1))
opt64_lowsizeclang -march=native -Os -fwrapv -Qunused-arguments -fPIC -fPIE -gdwarf-4 -Wall (Ubuntu_Clang_21.1.8_(6ubuntu1))

TIMECOP error (can be valgrind bug)


error 132

Process terminating with default action of signal 4 (SIGILL)
 Illegal opcode at address 0x4005B98
   at 0x...: memset (string_fortified.h:59)
   by 0x...: cpucycles_works (wrapper.c:59)
   by 0x...: supercop_cpucycles_ticks_amd64_tsc_setup (amd64-tsc.c:28)
   by 0x...: cpucycles_init (wrapper.c:314)
   by 0x...: main (try-anything.c:330)
Illegal instruction (core dumped)

Number of similar (implementation,compiler) pairs: 1, namely:
ImplementationCompiler
opt32_lowsizegcc -march=native -mtune=native -O2 -fwrapv -fPIC -fPIE -gdwarf-4 -Wall (15.2.0)

TIMECOP error (can be valgrind bug)


error 132

Process terminating with default action of signal 4 (SIGILL)
 Illegal opcode at address 0x4006158
   at 0x...: memset (string_fortified.h:59)
   by 0x...: cpucycles_works (wrapper.c:59)
   by 0x...: supercop_cpucycles_ticks_amd64_tsc_setup (amd64-tsc.c:28)
   by 0x...: cpucycles_init (wrapper.c:314)
   by 0x...: main (try-anything.c:330)
Illegal instruction (core dumped)

Number of similar (implementation,compiler) pairs: 1, namely:
ImplementationCompiler
opt32_lowsizegcc -march=native -mtune=native -O3 -fwrapv -fPIC -fPIE -gdwarf-4 -Wall (15.2.0)

TIMECOP error (can be valgrind bug)


error 132

Process terminating with default action of signal 4 (SIGILL)
 Illegal opcode at address 0x4005DD8
   at 0x...: memset (string_fortified.h:59)
   by 0x...: cpucycles_works (wrapper.c:59)
   by 0x...: supercop_cpucycles_ticks_amd64_tsc_setup (amd64-tsc.c:28)
   by 0x...: cpucycles_init (wrapper.c:314)
   by 0x...: main (try-anything.c:330)
Illegal instruction (core dumped)

Number of similar (implementation,compiler) pairs: 1, namely:
ImplementationCompiler
opt32_lowsizegcc -march=native -mtune=native -O -fwrapv -fPIC -fPIE -gdwarf-4 -Wall (15.2.0)

TIMECOP error (can be valgrind bug)


error 132

Process terminating with default action of signal 4 (SIGILL)
 Illegal opcode at address 0x4005418
   at 0x...: memset (string_fortified.h:59)
   by 0x...: cpucycles_works (wrapper.c:59)
   by 0x...: supercop_cpucycles_ticks_amd64_tsc_setup (amd64-tsc.c:28)
   by 0x...: cpucycles_init (wrapper.c:314)
   by 0x...: main (try-anything.c:330)
Illegal instruction (core dumped)

Number of similar (implementation,compiler) pairs: 1, namely:
ImplementationCompiler
opt32_lowsizegcc -march=native -mtune=native -Os -fwrapv -fPIC -fPIE -gdwarf-4 -Wall (15.2.0)

TIMECOP error (can be valgrind bug)


error 132

Process terminating with default action of signal 4 (SIGILL)
 Illegal opcode at address 0x4009AD8
   at 0x...: memset (string_fortified.h:59)
   by 0x...: cpucycles_works (wrapper.c:59)
   by 0x...: supercop_cpucycles_ticks_amd64_tsc_setup (amd64-tsc.c:28)
   by 0x...: cpucycles_init (wrapper.c:314)
   by 0x...: main (try-anything.c:330)
Illegal instruction (core dumped)

Number of similar (implementation,compiler) pairs: 1, namely:
ImplementationCompiler
opt64clang -march=native -O2 -fwrapv -Qunused-arguments -fPIC -fPIE -gdwarf-4 -Wall (Ubuntu_Clang_21.1.8_(6ubuntu1))

TIMECOP error (can be valgrind bug)


error 132

Process terminating with default action of signal 4 (SIGILL)
 Illegal opcode at address 0x4009CD8
   at 0x...: memset (string_fortified.h:59)
   by 0x...: cpucycles_works (wrapper.c:59)
   by 0x...: supercop_cpucycles_ticks_amd64_tsc_setup (amd64-tsc.c:28)
   by 0x...: cpucycles_init (wrapper.c:314)
   by 0x...: main (try-anything.c:330)
Illegal instruction (core dumped)

Number of similar (implementation,compiler) pairs: 1, namely:
ImplementationCompiler
opt64clang -march=native -O3 -fwrapv -Qunused-arguments -fPIC -fPIE -gdwarf-4 -Wall (Ubuntu_Clang_21.1.8_(6ubuntu1))

TIMECOP error (can be valgrind bug)


error 132

Process terminating with default action of signal 4 (SIGILL)
 Illegal opcode at address 0x4009058
   at 0x...: memset (string_fortified.h:59)
   by 0x...: cpucycles_works (wrapper.c:59)
   by 0x...: supercop_cpucycles_ticks_amd64_tsc_setup (amd64-tsc.c:28)
   by 0x...: cpucycles_init (wrapper.c:314)
   by 0x...: main (try-anything.c:330)
Illegal instruction (core dumped)

Number of similar (implementation,compiler) pairs: 1, namely:
ImplementationCompiler
opt64clang -march=native -O -fwrapv -Qunused-arguments -fPIC -fPIE -gdwarf-4 -Wall (Ubuntu_Clang_21.1.8_(6ubuntu1))

TIMECOP error (can be valgrind bug)


error 132

Process terminating with default action of signal 4 (SIGILL)
 Illegal opcode at address 0x40091D8
   at 0x...: memset (string_fortified.h:59)
   by 0x...: cpucycles_works (wrapper.c:59)
   by 0x...: supercop_cpucycles_ticks_amd64_tsc_setup (amd64-tsc.c:28)
   by 0x...: cpucycles_init (wrapper.c:314)
   by 0x...: main (try-anything.c:330)
Illegal instruction (core dumped)

Number of similar (implementation,compiler) pairs: 1, namely:
ImplementationCompiler
opt64clang -march=native -Os -fwrapv -Qunused-arguments -fPIC -fPIE -gdwarf-4 -Wall (Ubuntu_Clang_21.1.8_(6ubuntu1))

TIMECOP error (can be valgrind bug)


error 132

Process terminating with default action of signal 4 (SIGILL)
 Illegal opcode at address 0x4009A58
   at 0x...: memset (string_fortified.h:59)
   by 0x...: cpucycles_works (wrapper.c:59)
   by 0x...: supercop_cpucycles_ticks_amd64_tsc_setup (amd64-tsc.c:28)
   by 0x...: cpucycles_init (wrapper.c:314)
   by 0x...: main (try-anything.c:330)
Illegal instruction (core dumped)

Number of similar (implementation,compiler) pairs: 1, namely:
ImplementationCompiler
opt64gcc -march=native -mtune=native -O2 -fwrapv -fPIC -fPIE -gdwarf-4 -Wall (15.2.0)

TIMECOP error (can be valgrind bug)


error 132

Process terminating with default action of signal 4 (SIGILL)
 Illegal opcode at address 0x4009F18
   at 0x...: memset (string_fortified.h:59)
   by 0x...: cpucycles_works (wrapper.c:59)
   by 0x...: supercop_cpucycles_ticks_amd64_tsc_setup (amd64-tsc.c:28)
   by 0x...: cpucycles_init (wrapper.c:314)
   by 0x...: main (try-anything.c:330)
Illegal instruction (core dumped)

Number of similar (implementation,compiler) pairs: 1, namely:
ImplementationCompiler
opt64gcc -march=native -mtune=native -O3 -fwrapv -fPIC -fPIE -gdwarf-4 -Wall (15.2.0)

TIMECOP error (can be valgrind bug)


error 132

Process terminating with default action of signal 4 (SIGILL)
 Illegal opcode at address 0x400A798
   at 0x...: memset (string_fortified.h:59)
   by 0x...: cpucycles_works (wrapper.c:59)
   by 0x...: supercop_cpucycles_ticks_amd64_tsc_setup (amd64-tsc.c:28)
   by 0x...: cpucycles_init (wrapper.c:314)
   by 0x...: main (try-anything.c:330)
Illegal instruction (core dumped)

Number of similar (implementation,compiler) pairs: 1, namely:
ImplementationCompiler
opt64gcc -march=native -mtune=native -O -fwrapv -fPIC -fPIE -gdwarf-4 -Wall (15.2.0)

TIMECOP error (can be valgrind bug)


error 132

Process terminating with default action of signal 4 (SIGILL)
 Illegal opcode at address 0x400B118
   at 0x...: memset (string_fortified.h:59)
   by 0x...: cpucycles_works (wrapper.c:59)
   by 0x...: supercop_cpucycles_ticks_amd64_tsc_setup (amd64-tsc.c:28)
   by 0x...: cpucycles_init (wrapper.c:314)
   by 0x...: main (try-anything.c:330)
Illegal instruction (core dumped)

Number of similar (implementation,compiler) pairs: 1, namely:
ImplementationCompiler
opt64gcc -march=native -mtune=native -Os -fwrapv -fPIC -fPIE -gdwarf-4 -Wall (15.2.0)

TIMECOP error (can be valgrind bug)


error 132

Process terminating with default action of signal 4 (SIGILL)
 Illegal opcode at address 0x4006058
   at 0x...: memset (string_fortified.h:59)
   by 0x...: cpucycles_works (wrapper.c:59)
   by 0x...: supercop_cpucycles_ticks_amd64_tsc_setup (amd64-tsc.c:28)
   by 0x...: cpucycles_init (wrapper.c:314)
   by 0x...: main (try-anything.c:330)
Illegal instruction (core dumped)

Number of similar (implementation,compiler) pairs: 1, namely:
ImplementationCompiler
opt64_lowsizeclang -march=native -O2 -fwrapv -Qunused-arguments -fPIC -fPIE -gdwarf-4 -Wall (Ubuntu_Clang_21.1.8_(6ubuntu1))

TIMECOP error (can be valgrind bug)


error 132

Process terminating with default action of signal 4 (SIGILL)
 Illegal opcode at address 0x4006318
   at 0x...: memset (string_fortified.h:59)
   by 0x...: cpucycles_works (wrapper.c:59)
   by 0x...: supercop_cpucycles_ticks_amd64_tsc_setup (amd64-tsc.c:28)
   by 0x...: cpucycles_init (wrapper.c:314)
   by 0x...: main (try-anything.c:330)
Illegal instruction (core dumped)

Number of similar (implementation,compiler) pairs: 1, namely:
ImplementationCompiler
opt64_lowsizeclang -march=native -O3 -fwrapv -Qunused-arguments -fPIC -fPIE -gdwarf-4 -Wall (Ubuntu_Clang_21.1.8_(6ubuntu1))

TIMECOP error (can be valgrind bug)


error 132

Process terminating with default action of signal 4 (SIGILL)
 Illegal opcode at address 0x4005398
   at 0x...: memset (string_fortified.h:59)
   by 0x...: cpucycles_works (wrapper.c:59)
   by 0x...: supercop_cpucycles_ticks_amd64_tsc_setup (amd64-tsc.c:28)
   by 0x...: cpucycles_init (wrapper.c:314)
   by 0x...: main (try-anything.c:330)
Illegal instruction (core dumped)

Number of similar (implementation,compiler) pairs: 2, namely:
ImplementationCompiler
opt64_lowsizeclang -march=native -O -fwrapv -Qunused-arguments -fPIC -fPIE -gdwarf-4 -Wall (Ubuntu_Clang_21.1.8_(6ubuntu1))
opt64_lowsizegcc -march=native -mtune=native -Os -fwrapv -fPIC -fPIE -gdwarf-4 -Wall (15.2.0)

TIMECOP error (can be valgrind bug)


error 132

Process terminating with default action of signal 4 (SIGILL)
 Illegal opcode at address 0x4005B58
   at 0x...: memset (string_fortified.h:59)
   by 0x...: cpucycles_works (wrapper.c:59)
   by 0x...: supercop_cpucycles_ticks_amd64_tsc_setup (amd64-tsc.c:28)
   by 0x...: cpucycles_init (wrapper.c:314)
   by 0x...: main (try-anything.c:330)
Illegal instruction (core dumped)

Number of similar (implementation,compiler) pairs: 1, namely:
ImplementationCompiler
opt64_lowsizegcc -march=native -mtune=native -O2 -fwrapv -fPIC -fPIE -gdwarf-4 -Wall (15.2.0)

TIMECOP error (can be valgrind bug)


error 132

Process terminating with default action of signal 4 (SIGILL)
 Illegal opcode at address 0x4006118
   at 0x...: memset (string_fortified.h:59)
   by 0x...: cpucycles_works (wrapper.c:59)
   by 0x...: supercop_cpucycles_ticks_amd64_tsc_setup (amd64-tsc.c:28)
   by 0x...: cpucycles_init (wrapper.c:314)
   by 0x...: main (try-anything.c:330)
Illegal instruction (core dumped)

Number of similar (implementation,compiler) pairs: 1, namely:
ImplementationCompiler
opt64_lowsizegcc -march=native -mtune=native -O3 -fwrapv -fPIC -fPIE -gdwarf-4 -Wall (15.2.0)

TIMECOP error (can be valgrind bug)


error 132

Process terminating with default action of signal 4 (SIGILL)
 Illegal opcode at address 0x4005D98
   at 0x...: memset (string_fortified.h:59)
   by 0x...: cpucycles_works (wrapper.c:59)
   by 0x...: supercop_cpucycles_ticks_amd64_tsc_setup (amd64-tsc.c:28)
   by 0x...: cpucycles_init (wrapper.c:314)
   by 0x...: main (try-anything.c:330)
Illegal instruction (core dumped)

Number of similar (implementation,compiler) pairs: 1, namely:
ImplementationCompiler
opt64_lowsizegcc -march=native -mtune=native -O -fwrapv -fPIC -fPIE -gdwarf-4 -Wall (15.2.0)

TIMECOP error (can be valgrind bug)


error 132

Process terminating with default action of signal 4 (SIGILL)
 Illegal opcode at address 0x4007018
   at 0x...: memset (string_fortified.h:59)
   by 0x...: cpucycles_works (wrapper.c:59)
   by 0x...: supercop_cpucycles_ticks_amd64_tsc_setup (amd64-tsc.c:28)
   by 0x...: cpucycles_init (wrapper.c:314)
   by 0x...: main (try-anything.c:330)
Illegal instruction (core dumped)

Number of similar (implementation,compiler) pairs: 2, namely:
ImplementationCompiler
opt8clang -march=native -O2 -fwrapv -Qunused-arguments -fPIC -fPIE -gdwarf-4 -Wall (Ubuntu_Clang_21.1.8_(6ubuntu1))
opt8_lowsizeclang -march=native -O2 -fwrapv -Qunused-arguments -fPIC -fPIE -gdwarf-4 -Wall (Ubuntu_Clang_21.1.8_(6ubuntu1))

TIMECOP error (can be valgrind bug)


error 132

Process terminating with default action of signal 4 (SIGILL)
 Illegal opcode at address 0x4007418
   at 0x...: memset (string_fortified.h:59)
   by 0x...: cpucycles_works (wrapper.c:59)
   by 0x...: supercop_cpucycles_ticks_amd64_tsc_setup (amd64-tsc.c:28)
   by 0x...: cpucycles_init (wrapper.c:314)
   by 0x...: main (try-anything.c:330)
Illegal instruction (core dumped)

Number of similar (implementation,compiler) pairs: 2, namely:
ImplementationCompiler
opt8clang -march=native -O3 -fwrapv -Qunused-arguments -fPIC -fPIE -gdwarf-4 -Wall (Ubuntu_Clang_21.1.8_(6ubuntu1))
opt8_lowsizeclang -march=native -O3 -fwrapv -Qunused-arguments -fPIC -fPIE -gdwarf-4 -Wall (Ubuntu_Clang_21.1.8_(6ubuntu1))

TIMECOP error (can be valgrind bug)


error 132

Process terminating with default action of signal 4 (SIGILL)
 Illegal opcode at address 0x4005F18
   at 0x...: memset (string_fortified.h:59)
   by 0x...: cpucycles_works (wrapper.c:59)
   by 0x...: supercop_cpucycles_ticks_amd64_tsc_setup (amd64-tsc.c:28)
   by 0x...: cpucycles_init (wrapper.c:314)
   by 0x...: main (try-anything.c:330)
Illegal instruction (core dumped)

Number of similar (implementation,compiler) pairs: 2, namely:
ImplementationCompiler
opt8clang -march=native -O -fwrapv -Qunused-arguments -fPIC -fPIE -gdwarf-4 -Wall (Ubuntu_Clang_21.1.8_(6ubuntu1))
opt8_lowsizeclang -march=native -O -fwrapv -Qunused-arguments -fPIC -fPIE -gdwarf-4 -Wall (Ubuntu_Clang_21.1.8_(6ubuntu1))

TIMECOP error (can be valgrind bug)


error 132

Process terminating with default action of signal 4 (SIGILL)
 Illegal opcode at address 0x4006498
   at 0x...: memset (string_fortified.h:59)
   by 0x...: cpucycles_works (wrapper.c:59)
   by 0x...: supercop_cpucycles_ticks_amd64_tsc_setup (amd64-tsc.c:28)
   by 0x...: cpucycles_init (wrapper.c:314)
   by 0x...: main (try-anything.c:330)
Illegal instruction (core dumped)

Number of similar (implementation,compiler) pairs: 1, namely:
ImplementationCompiler
opt8gcc -march=native -mtune=native -O2 -fwrapv -fPIC -fPIE -gdwarf-4 -Wall (15.2.0)

TIMECOP error (can be valgrind bug)


error 132

Process terminating with default action of signal 4 (SIGILL)
 Illegal opcode at address 0x4007218
   at 0x...: memset (string_fortified.h:59)
   by 0x...: cpucycles_works (wrapper.c:59)
   by 0x...: supercop_cpucycles_ticks_amd64_tsc_setup (amd64-tsc.c:28)
   by 0x...: cpucycles_init (wrapper.c:314)
   by 0x...: main (try-anything.c:330)
Illegal instruction (core dumped)

Number of similar (implementation,compiler) pairs: 1, namely:
ImplementationCompiler
opt8gcc -march=native -mtune=native -O3 -fwrapv -fPIC -fPIE -gdwarf-4 -Wall (15.2.0)

TIMECOP error (can be valgrind bug)


error 132

Process terminating with default action of signal 4 (SIGILL)
 Illegal opcode at address 0x4006B98
   at 0x...: memset (string_fortified.h:59)
   by 0x...: cpucycles_works (wrapper.c:59)
   by 0x...: supercop_cpucycles_ticks_amd64_tsc_setup (amd64-tsc.c:28)
   by 0x...: cpucycles_init (wrapper.c:314)
   by 0x...: main (try-anything.c:330)
Illegal instruction (core dumped)

Number of similar (implementation,compiler) pairs: 1, namely:
ImplementationCompiler
opt8gcc -march=native -mtune=native -O -fwrapv -fPIC -fPIE -gdwarf-4 -Wall (15.2.0)

TIMECOP error (can be valgrind bug)


error 132

Process terminating with default action of signal 4 (SIGILL)
 Illegal opcode at address 0x4006B58
   at 0x...: memset (string_fortified.h:59)
   by 0x...: cpucycles_works (wrapper.c:59)
   by 0x...: supercop_cpucycles_ticks_amd64_tsc_setup (amd64-tsc.c:28)
   by 0x...: cpucycles_init (wrapper.c:314)
   by 0x...: main (try-anything.c:330)
Illegal instruction (core dumped)

Number of similar (implementation,compiler) pairs: 1, namely:
ImplementationCompiler
opt8_lowsizegcc -march=native -mtune=native -O -fwrapv -fPIC -fPIE -gdwarf-4 -Wall (15.2.0)

TIMECOP error (can be valgrind bug)


error 132

Process terminating with default action of signal 4 (SIGILL)
 Illegal opcode at address 0x4007CD8
   at 0x...: memset (string_fortified.h:59)
   by 0x...: cpucycles_works (wrapper.c:59)
   by 0x...: supercop_cpucycles_ticks_amd64_tsc_setup (amd64-tsc.c:28)
   by 0x...: cpucycles_init (wrapper.c:314)
   by 0x...: main (try-anything.c:330)
Illegal instruction (core dumped)

Number of similar (implementation,compiler) pairs: 1, namely:
ImplementationCompiler
refclang -march=native -O2 -fwrapv -Qunused-arguments -fPIC -fPIE -gdwarf-4 -Wall (Ubuntu_Clang_21.1.8_(6ubuntu1))

TIMECOP error (can be valgrind bug)


error 132

Process terminating with default action of signal 4 (SIGILL)
 Illegal opcode at address 0x4007E98
   at 0x...: memset (string_fortified.h:59)
   by 0x...: cpucycles_works (wrapper.c:59)
   by 0x...: supercop_cpucycles_ticks_amd64_tsc_setup (amd64-tsc.c:28)
   by 0x...: cpucycles_init (wrapper.c:314)
   by 0x...: main (try-anything.c:330)
Illegal instruction (core dumped)

Number of similar (implementation,compiler) pairs: 1, namely:
ImplementationCompiler
refclang -march=native -O3 -fwrapv -Qunused-arguments -fPIC -fPIE -gdwarf-4 -Wall (Ubuntu_Clang_21.1.8_(6ubuntu1))

TIMECOP error (can be valgrind bug)


error 132

Process terminating with default action of signal 4 (SIGILL)
 Illegal opcode at address 0x4006818
   at 0x...: memset (string_fortified.h:59)
   by 0x...: cpucycles_works (wrapper.c:59)
   by 0x...: supercop_cpucycles_ticks_amd64_tsc_setup (amd64-tsc.c:28)
   by 0x...: cpucycles_init (wrapper.c:314)
   by 0x...: main (try-anything.c:330)
Illegal instruction (core dumped)

Number of similar (implementation,compiler) pairs: 1, namely:
ImplementationCompiler
refclang -march=native -O -fwrapv -Qunused-arguments -fPIC -fPIE -gdwarf-4 -Wall (Ubuntu_Clang_21.1.8_(6ubuntu1))

TIMECOP error (can be valgrind bug)


error 132

Process terminating with default action of signal 4 (SIGILL)
 Illegal opcode at address 0x4008898
   at 0x...: memset (string_fortified.h:59)
   by 0x...: cpucycles_works (wrapper.c:59)
   by 0x...: supercop_cpucycles_ticks_amd64_tsc_setup (amd64-tsc.c:28)
   by 0x...: cpucycles_init (wrapper.c:314)
   by 0x...: main (try-anything.c:330)
Illegal instruction (core dumped)

Number of similar (implementation,compiler) pairs: 1, namely:
ImplementationCompiler
refgcc -march=native -mtune=native -O2 -fwrapv -fPIC -fPIE -gdwarf-4 -Wall (15.2.0)

TIMECOP error (can be valgrind bug)


error 132

Process terminating with default action of signal 4 (SIGILL)
 Illegal opcode at address 0x400A958
   at 0x...: memset (string_fortified.h:59)
   by 0x...: cpucycles_works (wrapper.c:59)
   by 0x...: supercop_cpucycles_ticks_amd64_tsc_setup (amd64-tsc.c:28)
   by 0x...: cpucycles_init (wrapper.c:314)
   by 0x...: main (try-anything.c:330)
Illegal instruction (core dumped)

Number of similar (implementation,compiler) pairs: 1, namely:
ImplementationCompiler
refgcc -march=native -mtune=native -O3 -fwrapv -fPIC -fPIE -gdwarf-4 -Wall (15.2.0)

TIMECOP error (can be valgrind bug)


error 132

Process terminating with default action of signal 4 (SIGILL)
 Illegal opcode at address 0x4008718
   at 0x...: memset (string_fortified.h:59)
   by 0x...: cpucycles_works (wrapper.c:59)
   by 0x...: supercop_cpucycles_ticks_amd64_tsc_setup (amd64-tsc.c:28)
   by 0x...: cpucycles_init (wrapper.c:314)
   by 0x...: main (try-anything.c:330)
Illegal instruction (core dumped)

Number of similar (implementation,compiler) pairs: 1, namely:
ImplementationCompiler
refgcc -march=native -mtune=native -O -fwrapv -fPIC -fPIE -gdwarf-4 -Wall (15.2.0)

TIMECOP error (can be valgrind bug)


error 132

Process terminating with default action of signal 4 (SIGILL)
 Illegal opcode at address 0x4005A18
   at 0x...: memset (string_fortified.h:59)
   by 0x...: cpucycles_works (wrapper.c:59)
   by 0x...: supercop_cpucycles_ticks_amd64_tsc_setup (amd64-tsc.c:28)
   by 0x...: cpucycles_init (wrapper.c:314)
   by 0x...: main (try-anything.c:330)
Illegal instruction (core dumped)

Number of similar (implementation,compiler) pairs: 1, namely:
ImplementationCompiler
refgcc -march=native -mtune=native -Os -fwrapv -fPIC -fPIE -gdwarf-4 -Wall (15.2.0)