Test results for amd64, cezanne, crypto_hash/mgrostl256
[Page version: 20241022 22:30:04]
Measurements for amd64, cezanne, crypto_hash
Test results for amd64, cezanne, crypto_hash
Test results for crypto_hash/mgrostl256
Computer: cezanne
Microarchitecture: amd64; Zen 3 (a50f00)
Architecture: amd64
CPU ID: AuthenticAMD-00a50f00-178bfbff
SUPERCOP version: 20241022
Operation: crypto_hash
Primitive: mgrostl256
Time | Object size | Test size | Implementation | Compiler | Benchmark date | SUPERCOP version |
53357 | 45852 0 0 | 33815 788 952 | T:opt-32 | gcc -march=native -mtune=native -O -fwrapv -fPIC -fPIE -gdwarf-4 -Wall | 20241011 | 20241011 |
53941 | 49105 0 0 | 37720 796 952 | T:opt-32 | gcc -march=native -mtune=native -O3 -fwrapv -fPIC -fPIE -gdwarf-4 -Wall | 20241011 | 20241011 |
54251 | 46881 0 0 | 34832 796 952 | T:opt-32 | gcc -march=native -mtune=native -O2 -fwrapv -fPIC -fPIE -gdwarf-4 -Wall | 20241011 | 20241011 |
58817 | 42598 0 0 | 31227 772 920 | T:opt-32 | gcc -march=native -mtune=native -Os -fwrapv -fPIC -fPIE -gdwarf-4 -Wall | 20241011 | 20241011 |
60073 | 50232 0 0 | 35910 820 888 | T:opt-32 | clang -march=native -O -fwrapv -Qunused-arguments -fPIC -fPIE -gdwarf-4 -Wall | 20241011 | 20241011 |
60380 | 55010 0 0 | 40878 836 888 | T:opt-32 | clang -mcpu=native -O3 -fwrapv -Qunused-arguments -fPIC -fPIE -gdwarf-4 -Wall | 20241011 | 20241011 |
62386 | 54514 0 0 | 40854 836 920 | T:opt-32 | clang -march=native -O2 -fwrapv -Qunused-arguments -fPIC -fPIE -gdwarf-4 -Wall | 20241011 | 20241011 |
62563 | 54738 0 0 | 41094 836 920 | T:opt-32 | clang -march=native -O3 -fwrapv -Qunused-arguments -fPIC -fPIE -gdwarf-4 -Wall | 20241011 | 20241011 |
64219 | 49312 0 0 | 35198 820 888 | T:opt-32 | clang -march=native -Os -fwrapv -Qunused-arguments -fPIC -fPIE -gdwarf-4 -Wall | 20241011 | 20241011 |
986471 | 15943 384 0 | 28961 1220 888 | T:ref | clang -mcpu=native -O3 -fwrapv -Qunused-arguments -fPIC -fPIE -gdwarf-4 -Wall | 20241011 | 20241011 |
987251 | 15311 384 0 | 28601 1220 920 | T:ref | clang -march=native -O3 -fwrapv -Qunused-arguments -fPIC -fPIE -gdwarf-4 -Wall | 20241011 | 20241011 |
996440 | 10743 384 0 | 23905 1220 920 | T:ref | clang -march=native -O2 -fwrapv -Qunused-arguments -fPIC -fPIE -gdwarf-4 -Wall | 20241011 | 20241011 |
1001585 | 4708 384 0 | 15385 1204 888 | T:ref | clang -march=native -O -fwrapv -Qunused-arguments -fPIC -fPIE -gdwarf-4 -Wall | 20241011 | 20241011 |
1032583 | 4298 384 0 | 14681 1204 888 | T:ref | clang -march=native -Os -fwrapv -Qunused-arguments -fPIC -fPIE -gdwarf-4 -Wall | 20241011 | 20241011 |
3088809 | 15552 384 0 | 28383 1180 952 | T:ref | gcc -march=native -mtune=native -O3 -fwrapv -fPIC -fPIE -gdwarf-4 -Wall | 20241011 | 20241011 |
3319893 | 5352 384 0 | 16471 1180 952 | T:ref | gcc -march=native -mtune=native -O2 -fwrapv -fPIC -fPIE -gdwarf-4 -Wall | 20241011 | 20241011 |
3385754 | 3865 384 0 | 13642 1156 920 | T:ref | gcc -march=native -mtune=native -Os -fwrapv -fPIC -fPIE -gdwarf-4 -Wall | 20241011 | 20241011 |
3667181 | 4561 384 0 | 15310 1172 952 | T:ref | gcc -march=native -mtune=native -O -fwrapv -fPIC -fPIE -gdwarf-4 -Wall | 20241011 | 20241011 |
Compiler output
hash.c: hash.c: In function 'Transform':
hash.c: hash.c:386:5: warning: 'F' may be used uninitialized in this function [-Wmaybe-uninitialized]
hash.c: 386 | F(ctx->chaining,(u32*)input,(u32*)ctx->counter);//modified oct28
hash.c: | ^~~~~~~~~~~~~~~~~~~~~~~~~~~~~~~~~~~~~~~~~~~~~~~
mGroestl.c: mGroestl.c: In function 'Transform':
mGroestl.c: mGroestl.c:384:5: warning: 'F' may be used uninitialized in this function [-Wmaybe-uninitialized]
mGroestl.c: 384 | F(ctx->chaining,(u32*)input,(u32*)ctx->counter);//modified oct28
mGroestl.c: | ^~~~~~~~~~~~~~~~~~~~~~~~~~~~~~~~~~~~~~~~~~~~~~~
Number of similar (implementation,compiler) pairs: 3, namely:
Implementation | Compiler |
T:opt-32 | gcc -march=native -mtune=native -O2 -fwrapv -fPIC -fPIE -gdwarf-4 -Wall (10.2.1_20210110) |
T:opt-32 | gcc -march=native -mtune=native -O -fwrapv -fPIC -fPIE -gdwarf-4 -Wall (10.2.1_20210110) |
T:opt-32 | gcc -march=native -mtune=native -Os -fwrapv -fPIC -fPIE -gdwarf-4 -Wall (10.2.1_20210110) |
Compiler output
hash.c: hash.c: In function 'Transform':
hash.c: hash.c:386:5: warning: 'F' may be used uninitialized in this function [-Wmaybe-uninitialized]
hash.c: 386 | F(ctx->chaining,(u32*)input,(u32*)ctx->counter);//modified oct28
hash.c: | ^~~~~~~~~~~~~~~~~~~~~~~~~~~~~~~~~~~~~~~~~~~~~~~
hash.c: hash.c: In function 'Update':
hash.c: hash.c:386:5: warning: 'F' may be used uninitialized in this function [-Wmaybe-uninitialized]
hash.c: 386 | F(ctx->chaining,(u32*)input,(u32*)ctx->counter);//modified oct28
hash.c: | ^~~~~~~~~~~~~~~~~~~~~~~~~~~~~~~~~~~~~~~~~~~~~~~
hash.c: hash.c:361:10: note: 'F' was declared here
hash.c: 361 | void (*F)(u32*,const u32*,u32*); //modified oct28
hash.c: | ^
hash.c: hash.c: In function 'Hash':
hash.c: hash.c:497:27: warning: 'context.blocksize' may be used uninitialized in this function [-Wmaybe-uninitialized]
hash.c: 497 | ctx->buffer = malloc(ctx->blocksize); //modified
hash.c: | ~~~^~~~~~~~~~~
mGroestl.c: mGroestl.c: In function 'Transform':
mGroestl.c: mGroestl.c:384:5: warning: 'F' may be used uninitialized in this function [-Wmaybe-uninitialized]
mGroestl.c: 384 | F(ctx->chaining,(u32*)input,(u32*)ctx->counter);//modified oct28
mGroestl.c: | ^~~~~~~~~~~~~~~~~~~~~~~~~~~~~~~~~~~~~~~~~~~~~~~
mGroestl.c: mGroestl.c: In function 'Update':
mGroestl.c: mGroestl.c:384:5: warning: 'F' may be used uninitialized in this function [-Wmaybe-uninitialized]
mGroestl.c: 384 | F(ctx->chaining,(u32*)input,(u32*)ctx->counter);//modified oct28
mGroestl.c: | ^~~~~~~~~~~~~~~~~~~~~~~~~~~~~~~~~~~~~~~~~~~~~~~
mGroestl.c: mGroestl.c:359:10: note: 'F' was declared here
mGroestl.c: 359 | void (*F)(u32*,const u32*,u32*); //modified oct28
mGroestl.c: | ^
mGroestl.c: mGroestl.c: In function 'Hash':
mGroestl.c: mGroestl.c:495:27: warning: 'context.blocksize' may be used uninitialized in this function [-Wmaybe-uninitialized]
mGroestl.c: 495 | ctx->buffer = malloc(ctx->blocksize); //modified
mGroestl.c: | ~~~^~~~~~~~~~~
Number of similar (implementation,compiler) pairs: 1, namely:
Implementation | Compiler |
T:opt-32 | gcc -march=native -mtune=native -O3 -fwrapv -fPIC -fPIE -gdwarf-4 -Wall (10.2.1_20210110) |
Compiler output
hash.c: hash.c:230:9: warning: unknown pragma ignored [-Wunknown-pragmas]
hash.c: #pragma vector aligned
hash.c: ^
hash.c: hash.c:239:3: warning: non-constant static local variable in inline function may be different in different files [-Wstatic-local-in-inline]
hash.c: static u64 y[COLS1024] __attribute__((aligned(16)));
hash.c: ^
hash.c: hash.c:238:1: note: use 'static' to give inline function 'F1024' internal linkage
hash.c: inline void F1024(u64 *h, const u64 *m) {
hash.c: ^
hash.c: static
hash.c: hash.c:240:3: warning: non-constant static local variable in inline function may be different in different files [-Wstatic-local-in-inline]
hash.c: static u64 z[COLS1024] __attribute__((aligned(16)));
hash.c: ^
hash.c: hash.c:238:1: note: use 'static' to give inline function 'F1024' internal linkage
hash.c: inline void F1024(u64 *h, const u64 *m) {
hash.c: ^
hash.c: static
hash.c: hash.c:241:3: warning: non-constant static local variable in inline function may be different in different files [-Wstatic-local-in-inline]
hash.c: static u64 outQ[COLS1024] __attribute__((aligned(16)));
hash.c: ^
hash.c: hash.c:238:1: note: use 'static' to give inline function 'F1024' internal linkage
hash.c: inline void F1024(u64 *h, const u64 *m) {
hash.c: ^
hash.c: static
hash.c: hash.c:242:3: warning: non-constant static local variable in inline function may be different in different files [-Wstatic-local-in-inline]
hash.c: ...
try.c: /usr/bin/ld: libcrypto_hash_mgrostl256.a(hash.o): in function `Transform':
try.c: .../supercop-data/cezanne/amd64/try/c/clang_-march=native_-O2_-fwrapv_-Qunused-arguments_-fPIC_-fPIE_-gdwarf-4_-Wall/timingleaks/crypto_hash/mgrostl256/opt-64/work/hash.c:304: undefined reference to `F512'
try.c: /usr/bin/ld: .../supercop-data/cezanne/amd64/try/c/clang_-march=native_-O2_-fwrapv_-Qunused-arguments_-fPIC_-fPIE_-gdwarf-4_-Wall/timingleaks/crypto_hash/mgrostl256/opt-64/work/hash.c:304: undefined reference to `F512'
try.c: /usr/bin/ld: .../supercop-data/cezanne/amd64/try/c/clang_-march=native_-O2_-fwrapv_-Qunused-arguments_-fPIC_-fPIE_-gdwarf-4_-Wall/timingleaks/crypto_hash/mgrostl256/opt-64/work/hash.c:304: undefined reference to `F512'
try.c: /usr/bin/ld: .../supercop-data/cezanne/amd64/try/c/clang_-march=native_-O2_-fwrapv_-Qunused-arguments_-fPIC_-fPIE_-gdwarf-4_-Wall/timingleaks/crypto_hash/mgrostl256/opt-64/work/hash.c:304: undefined reference to `F512'
try.c: /usr/bin/ld: .../supercop-data/cezanne/amd64/try/c/clang_-march=native_-O2_-fwrapv_-Qunused-arguments_-fPIC_-fPIE_-gdwarf-4_-Wall/timingleaks/crypto_hash/mgrostl256/opt-64/work/hash.c:304: undefined reference to `F512'
try.c: clang: error: linker command failed with exit code 1 (use -v to see invocation)
Number of similar (implementation,compiler) pairs: 1, namely:
Implementation | Compiler |
T:opt-64 | clang -march=native -O2 -fwrapv -Qunused-arguments -fPIC -fPIE -gdwarf-4 -Wall (Debian_Clang_11.0.1) |
Compiler output
hash.c: hash.c:230:9: warning: unknown pragma ignored [-Wunknown-pragmas]
hash.c: #pragma vector aligned
hash.c: ^
hash.c: hash.c:239:3: warning: non-constant static local variable in inline function may be different in different files [-Wstatic-local-in-inline]
hash.c: static u64 y[COLS1024] __attribute__((aligned(16)));
hash.c: ^
hash.c: hash.c:238:1: note: use 'static' to give inline function 'F1024' internal linkage
hash.c: inline void F1024(u64 *h, const u64 *m) {
hash.c: ^
hash.c: static
hash.c: hash.c:240:3: warning: non-constant static local variable in inline function may be different in different files [-Wstatic-local-in-inline]
hash.c: static u64 z[COLS1024] __attribute__((aligned(16)));
hash.c: ^
hash.c: hash.c:238:1: note: use 'static' to give inline function 'F1024' internal linkage
hash.c: inline void F1024(u64 *h, const u64 *m) {
hash.c: ^
hash.c: static
hash.c: hash.c:241:3: warning: non-constant static local variable in inline function may be different in different files [-Wstatic-local-in-inline]
hash.c: static u64 outQ[COLS1024] __attribute__((aligned(16)));
hash.c: ^
hash.c: hash.c:238:1: note: use 'static' to give inline function 'F1024' internal linkage
hash.c: inline void F1024(u64 *h, const u64 *m) {
hash.c: ^
hash.c: static
hash.c: hash.c:242:3: warning: non-constant static local variable in inline function may be different in different files [-Wstatic-local-in-inline]
hash.c: ...
try.c: /usr/bin/ld: libcrypto_hash_mgrostl256.a(hash.o): in function `Transform':
try.c: .../supercop-data/cezanne/amd64/try/c/clang_-march=native_-O3_-fwrapv_-Qunused-arguments_-fPIC_-fPIE_-gdwarf-4_-Wall/timingleaks/crypto_hash/mgrostl256/opt-64/work/hash.c:304: undefined reference to `F512'
try.c: /usr/bin/ld: .../supercop-data/cezanne/amd64/try/c/clang_-march=native_-O3_-fwrapv_-Qunused-arguments_-fPIC_-fPIE_-gdwarf-4_-Wall/timingleaks/crypto_hash/mgrostl256/opt-64/work/hash.c:304: undefined reference to `F512'
try.c: /usr/bin/ld: .../supercop-data/cezanne/amd64/try/c/clang_-march=native_-O3_-fwrapv_-Qunused-arguments_-fPIC_-fPIE_-gdwarf-4_-Wall/timingleaks/crypto_hash/mgrostl256/opt-64/work/hash.c:304: undefined reference to `F512'
try.c: /usr/bin/ld: .../supercop-data/cezanne/amd64/try/c/clang_-march=native_-O3_-fwrapv_-Qunused-arguments_-fPIC_-fPIE_-gdwarf-4_-Wall/timingleaks/crypto_hash/mgrostl256/opt-64/work/hash.c:304: undefined reference to `F512'
try.c: /usr/bin/ld: .../supercop-data/cezanne/amd64/try/c/clang_-march=native_-O3_-fwrapv_-Qunused-arguments_-fPIC_-fPIE_-gdwarf-4_-Wall/timingleaks/crypto_hash/mgrostl256/opt-64/work/hash.c:304: undefined reference to `F512'
try.c: clang: error: linker command failed with exit code 1 (use -v to see invocation)
Number of similar (implementation,compiler) pairs: 1, namely:
Implementation | Compiler |
T:opt-64 | clang -march=native -O3 -fwrapv -Qunused-arguments -fPIC -fPIE -gdwarf-4 -Wall (Debian_Clang_11.0.1) |
Compiler output
hash.c: hash.c:230:9: warning: unknown pragma ignored [-Wunknown-pragmas]
hash.c: #pragma vector aligned
hash.c: ^
hash.c: hash.c:239:3: warning: non-constant static local variable in inline function may be different in different files [-Wstatic-local-in-inline]
hash.c: static u64 y[COLS1024] __attribute__((aligned(16)));
hash.c: ^
hash.c: hash.c:238:1: note: use 'static' to give inline function 'F1024' internal linkage
hash.c: inline void F1024(u64 *h, const u64 *m) {
hash.c: ^
hash.c: static
hash.c: hash.c:240:3: warning: non-constant static local variable in inline function may be different in different files [-Wstatic-local-in-inline]
hash.c: static u64 z[COLS1024] __attribute__((aligned(16)));
hash.c: ^
hash.c: hash.c:238:1: note: use 'static' to give inline function 'F1024' internal linkage
hash.c: inline void F1024(u64 *h, const u64 *m) {
hash.c: ^
hash.c: static
hash.c: hash.c:241:3: warning: non-constant static local variable in inline function may be different in different files [-Wstatic-local-in-inline]
hash.c: static u64 outQ[COLS1024] __attribute__((aligned(16)));
hash.c: ^
hash.c: hash.c:238:1: note: use 'static' to give inline function 'F1024' internal linkage
hash.c: inline void F1024(u64 *h, const u64 *m) {
hash.c: ^
hash.c: static
hash.c: hash.c:242:3: warning: non-constant static local variable in inline function may be different in different files [-Wstatic-local-in-inline]
hash.c: ...
try.c: /usr/bin/ld: libcrypto_hash_mgrostl256.a(hash.o): in function `Transform':
try.c: .../supercop-data/cezanne/amd64/try/c/clang_-march=native_-O_-fwrapv_-Qunused-arguments_-fPIC_-fPIE_-gdwarf-4_-Wall/timingleaks/crypto_hash/mgrostl256/opt-64/work/hash.c:304: undefined reference to `F512'
try.c: clang: error: linker command failed with exit code 1 (use -v to see invocation)
Number of similar (implementation,compiler) pairs: 1, namely:
Implementation | Compiler |
T:opt-64 | clang -march=native -O -fwrapv -Qunused-arguments -fPIC -fPIE -gdwarf-4 -Wall (Debian_Clang_11.0.1) |
Compiler output
hash.c: hash.c:230:9: warning: unknown pragma ignored [-Wunknown-pragmas]
hash.c: #pragma vector aligned
hash.c: ^
hash.c: hash.c:239:3: warning: non-constant static local variable in inline function may be different in different files [-Wstatic-local-in-inline]
hash.c: static u64 y[COLS1024] __attribute__((aligned(16)));
hash.c: ^
hash.c: hash.c:238:1: note: use 'static' to give inline function 'F1024' internal linkage
hash.c: inline void F1024(u64 *h, const u64 *m) {
hash.c: ^
hash.c: static
hash.c: hash.c:240:3: warning: non-constant static local variable in inline function may be different in different files [-Wstatic-local-in-inline]
hash.c: static u64 z[COLS1024] __attribute__((aligned(16)));
hash.c: ^
hash.c: hash.c:238:1: note: use 'static' to give inline function 'F1024' internal linkage
hash.c: inline void F1024(u64 *h, const u64 *m) {
hash.c: ^
hash.c: static
hash.c: hash.c:241:3: warning: non-constant static local variable in inline function may be different in different files [-Wstatic-local-in-inline]
hash.c: static u64 outQ[COLS1024] __attribute__((aligned(16)));
hash.c: ^
hash.c: hash.c:238:1: note: use 'static' to give inline function 'F1024' internal linkage
hash.c: inline void F1024(u64 *h, const u64 *m) {
hash.c: ^
hash.c: static
hash.c: hash.c:242:3: warning: non-constant static local variable in inline function may be different in different files [-Wstatic-local-in-inline]
hash.c: ...
try.c: /usr/bin/ld: libcrypto_hash_mgrostl256.a(hash.o): in function `Transform':
try.c: .../supercop-data/cezanne/amd64/try/c/clang_-march=native_-Os_-fwrapv_-Qunused-arguments_-fPIC_-fPIE_-gdwarf-4_-Wall/timingleaks/crypto_hash/mgrostl256/opt-64/work/hash.c:304: undefined reference to `F512'
try.c: clang: error: linker command failed with exit code 1 (use -v to see invocation)
Number of similar (implementation,compiler) pairs: 1, namely:
Implementation | Compiler |
T:opt-64 | clang -march=native -Os -fwrapv -Qunused-arguments -fPIC -fPIE -gdwarf-4 -Wall (Debian_Clang_11.0.1) |
Compiler output
hash.c: hash.c:230:9: warning: unknown pragma ignored [-Wunknown-pragmas]
hash.c: #pragma vector aligned
hash.c: ^
hash.c: hash.c:239:3: warning: non-constant static local variable in inline function may be different in different files [-Wstatic-local-in-inline]
hash.c: static u64 y[COLS1024] __attribute__((aligned(16)));
hash.c: ^
hash.c: hash.c:238:1: note: use 'static' to give inline function 'F1024' internal linkage
hash.c: inline void F1024(u64 *h, const u64 *m) {
hash.c: ^
hash.c: static
hash.c: hash.c:240:3: warning: non-constant static local variable in inline function may be different in different files [-Wstatic-local-in-inline]
hash.c: static u64 z[COLS1024] __attribute__((aligned(16)));
hash.c: ^
hash.c: hash.c:238:1: note: use 'static' to give inline function 'F1024' internal linkage
hash.c: inline void F1024(u64 *h, const u64 *m) {
hash.c: ^
hash.c: static
hash.c: hash.c:241:3: warning: non-constant static local variable in inline function may be different in different files [-Wstatic-local-in-inline]
hash.c: static u64 outQ[COLS1024] __attribute__((aligned(16)));
hash.c: ^
hash.c: hash.c:238:1: note: use 'static' to give inline function 'F1024' internal linkage
hash.c: inline void F1024(u64 *h, const u64 *m) {
hash.c: ^
hash.c: static
hash.c: hash.c:242:3: warning: non-constant static local variable in inline function may be different in different files [-Wstatic-local-in-inline]
hash.c: ...
try.c: /usr/bin/ld: libcrypto_hash_mgrostl256.a(hash.o): in function `Transform':
try.c: .../supercop-data/cezanne/amd64/try/c/clang_-mcpu=native_-O3_-fwrapv_-Qunused-arguments_-fPIC_-fPIE_-gdwarf-4_-Wall/timingleaks/crypto_hash/mgrostl256/opt-64/work/hash.c:304: undefined reference to `F512'
try.c: /usr/bin/ld: .../supercop-data/cezanne/amd64/try/c/clang_-mcpu=native_-O3_-fwrapv_-Qunused-arguments_-fPIC_-fPIE_-gdwarf-4_-Wall/timingleaks/crypto_hash/mgrostl256/opt-64/work/hash.c:304: undefined reference to `F512'
try.c: /usr/bin/ld: .../supercop-data/cezanne/amd64/try/c/clang_-mcpu=native_-O3_-fwrapv_-Qunused-arguments_-fPIC_-fPIE_-gdwarf-4_-Wall/timingleaks/crypto_hash/mgrostl256/opt-64/work/hash.c:304: undefined reference to `F512'
try.c: /usr/bin/ld: .../supercop-data/cezanne/amd64/try/c/clang_-mcpu=native_-O3_-fwrapv_-Qunused-arguments_-fPIC_-fPIE_-gdwarf-4_-Wall/timingleaks/crypto_hash/mgrostl256/opt-64/work/hash.c:304: undefined reference to `F512'
try.c: /usr/bin/ld: .../supercop-data/cezanne/amd64/try/c/clang_-mcpu=native_-O3_-fwrapv_-Qunused-arguments_-fPIC_-fPIE_-gdwarf-4_-Wall/timingleaks/crypto_hash/mgrostl256/opt-64/work/hash.c:304: undefined reference to `F512'
try.c: clang: error: linker command failed with exit code 1 (use -v to see invocation)
Number of similar (implementation,compiler) pairs: 1, namely:
Implementation | Compiler |
T:opt-64 | clang -mcpu=native -O3 -fwrapv -Qunused-arguments -fPIC -fPIE -gdwarf-4 -Wall (Debian_Clang_11.0.1) |
Compiler output
hash.c: hash.c: In function 'F512':
hash.c: hash.c:230: warning: ignoring '#pragma vector aligned' [-Wunknown-pragmas]
hash.c: 230 | #pragma vector aligned
hash.c: |
hash.c: hash.c: In function 'F1024':
hash.c: hash.c:267: warning: ignoring '#pragma vector aligned' [-Wunknown-pragmas]
hash.c: 267 | #pragma vector aligned
hash.c: |
hash.c: hash.c: At top level:
hash.c: hash.c:242:14: warning: 'inP' is static but declared in inline function 'F1024' which is not static
hash.c: 242 | static u64 inP[COLS1024] __attribute__((aligned(16)));
hash.c: | ^~~
hash.c: hash.c:241:14: warning: 'outQ' is static but declared in inline function 'F1024' which is not static
hash.c: 241 | static u64 outQ[COLS1024] __attribute__((aligned(16)));
hash.c: | ^~~~
hash.c: hash.c:240:14: warning: 'z' is static but declared in inline function 'F1024' which is not static
hash.c: 240 | static u64 z[COLS1024] __attribute__((aligned(16)));
hash.c: | ^
hash.c: hash.c:239:14: warning: 'y' is static but declared in inline function 'F1024' which is not static
hash.c: 239 | static u64 y[COLS1024] __attribute__((aligned(16)));
hash.c: | ^
try.c: /usr/bin/ld: libcrypto_hash_mgrostl256.a(hash.o): in function `Transform':
try.c: .../supercop-data/cezanne/amd64/try/c/gcc_-march=native_-mtune=native_-O2_-fwrapv_-fPIC_-fPIE_-gdwarf-4_-Wall/timingleaks/crypto_hash/mgrostl256/opt-64/work/hash.c:304: undefined reference to `F512'
try.c: collect2: error: ld returned 1 exit status
Number of similar (implementation,compiler) pairs: 1, namely:
Implementation | Compiler |
T:opt-64 | gcc -march=native -mtune=native -O2 -fwrapv -fPIC -fPIE -gdwarf-4 -Wall (10.2.1_20210110) |
Compiler output
hash.c: hash.c: In function 'F512':
hash.c: hash.c:230: warning: ignoring '#pragma vector aligned' [-Wunknown-pragmas]
hash.c: 230 | #pragma vector aligned
hash.c: |
hash.c: hash.c: In function 'F1024':
hash.c: hash.c:267: warning: ignoring '#pragma vector aligned' [-Wunknown-pragmas]
hash.c: 267 | #pragma vector aligned
hash.c: |
hash.c: hash.c: At top level:
hash.c: hash.c:242:14: warning: 'inP' is static but declared in inline function 'F1024' which is not static
hash.c: 242 | static u64 inP[COLS1024] __attribute__((aligned(16)));
hash.c: | ^~~
hash.c: hash.c:241:14: warning: 'outQ' is static but declared in inline function 'F1024' which is not static
hash.c: 241 | static u64 outQ[COLS1024] __attribute__((aligned(16)));
hash.c: | ^~~~
hash.c: hash.c:240:14: warning: 'z' is static but declared in inline function 'F1024' which is not static
hash.c: 240 | static u64 z[COLS1024] __attribute__((aligned(16)));
hash.c: | ^
hash.c: hash.c:239:14: warning: 'y' is static but declared in inline function 'F1024' which is not static
hash.c: 239 | static u64 y[COLS1024] __attribute__((aligned(16)));
hash.c: | ^
hash.c: hash.c: In function 'Hash':
hash.c: hash.c:434:30: warning: 'context.statesize' may be used uninitialized in this function [-Wmaybe-uninitialized]
hash.c: 434 | while (ctx->cnt_buf_ptr < ctx->statesize) {
hash.c: | ~~~^~~~~~~~~~~
try.c: /usr/bin/ld: libcrypto_hash_mgrostl256.a(hash.o): in function `Transform':
try.c: .../supercop-data/cezanne/amd64/try/c/gcc_-march=native_-mtune=native_-O3_-fwrapv_-fPIC_-fPIE_-gdwarf-4_-Wall/timingleaks/crypto_hash/mgrostl256/opt-64/work/hash.c:304: undefined reference to `F512'
try.c: /usr/bin/ld: .../supercop-data/cezanne/amd64/try/c/gcc_-march=native_-mtune=native_-O3_-fwrapv_-fPIC_-fPIE_-gdwarf-4_-Wall/timingleaks/crypto_hash/mgrostl256/opt-64/work/hash.c:304: undefined reference to `F512'
try.c: /usr/bin/ld: .../supercop-data/cezanne/amd64/try/c/gcc_-march=native_-mtune=native_-O3_-fwrapv_-fPIC_-fPIE_-gdwarf-4_-Wall/timingleaks/crypto_hash/mgrostl256/opt-64/work/hash.c:304: undefined reference to `F512'
try.c: /usr/bin/ld: .../supercop-data/cezanne/amd64/try/c/gcc_-march=native_-mtune=native_-O3_-fwrapv_-fPIC_-fPIE_-gdwarf-4_-Wall/timingleaks/crypto_hash/mgrostl256/opt-64/work/hash.c:304: undefined reference to `F512'
try.c: /usr/bin/ld: .../supercop-data/cezanne/amd64/try/c/gcc_-march=native_-mtune=native_-O3_-fwrapv_-fPIC_-fPIE_-gdwarf-4_-Wall/timingleaks/crypto_hash/mgrostl256/opt-64/work/hash.c:304: undefined reference to `F512'
try.c: collect2: error: ld returned 1 exit status
Number of similar (implementation,compiler) pairs: 1, namely:
Implementation | Compiler |
T:opt-64 | gcc -march=native -mtune=native -O3 -fwrapv -fPIC -fPIE -gdwarf-4 -Wall (10.2.1_20210110) |
Compiler output
hash.c: hash.c: In function 'F512':
hash.c: hash.c:230: warning: ignoring '#pragma vector aligned' [-Wunknown-pragmas]
hash.c: 230 | #pragma vector aligned
hash.c: |
hash.c: hash.c: In function 'F1024':
hash.c: hash.c:267: warning: ignoring '#pragma vector aligned' [-Wunknown-pragmas]
hash.c: 267 | #pragma vector aligned
hash.c: |
hash.c: hash.c: At top level:
hash.c: hash.c:242:14: warning: 'inP' is static but declared in inline function 'F1024' which is not static
hash.c: 242 | static u64 inP[COLS1024] __attribute__((aligned(16)));
hash.c: | ^~~
hash.c: hash.c:241:14: warning: 'outQ' is static but declared in inline function 'F1024' which is not static
hash.c: 241 | static u64 outQ[COLS1024] __attribute__((aligned(16)));
hash.c: | ^~~~
hash.c: hash.c:240:14: warning: 'z' is static but declared in inline function 'F1024' which is not static
hash.c: 240 | static u64 z[COLS1024] __attribute__((aligned(16)));
hash.c: | ^
hash.c: hash.c:239:14: warning: 'y' is static but declared in inline function 'F1024' which is not static
hash.c: 239 | static u64 y[COLS1024] __attribute__((aligned(16)));
hash.c: | ^
try.c: /usr/bin/ld: libcrypto_hash_mgrostl256.a(hash.o): in function `Transform':
try.c: .../supercop-data/cezanne/amd64/try/c/gcc_-march=native_-mtune=native_-O_-fwrapv_-fPIC_-fPIE_-gdwarf-4_-Wall/timingleaks/crypto_hash/mgrostl256/opt-64/work/hash.c:304: undefined reference to `F512'
try.c: collect2: error: ld returned 1 exit status
Number of similar (implementation,compiler) pairs: 1, namely:
Implementation | Compiler |
T:opt-64 | gcc -march=native -mtune=native -O -fwrapv -fPIC -fPIE -gdwarf-4 -Wall (10.2.1_20210110) |
Compiler output
hash.c: hash.c: In function 'F512':
hash.c: hash.c:230: warning: ignoring '#pragma vector aligned' [-Wunknown-pragmas]
hash.c: 230 | #pragma vector aligned
hash.c: |
hash.c: hash.c: In function 'F1024':
hash.c: hash.c:267: warning: ignoring '#pragma vector aligned' [-Wunknown-pragmas]
hash.c: 267 | #pragma vector aligned
hash.c: |
hash.c: hash.c: At top level:
hash.c: hash.c:242:14: warning: 'inP' is static but declared in inline function 'F1024' which is not static
hash.c: 242 | static u64 inP[COLS1024] __attribute__((aligned(16)));
hash.c: | ^~~
hash.c: hash.c:241:14: warning: 'outQ' is static but declared in inline function 'F1024' which is not static
hash.c: 241 | static u64 outQ[COLS1024] __attribute__((aligned(16)));
hash.c: | ^~~~
hash.c: hash.c:240:14: warning: 'z' is static but declared in inline function 'F1024' which is not static
hash.c: 240 | static u64 z[COLS1024] __attribute__((aligned(16)));
hash.c: | ^
hash.c: hash.c:239:14: warning: 'y' is static but declared in inline function 'F1024' which is not static
hash.c: 239 | static u64 y[COLS1024] __attribute__((aligned(16)));
hash.c: | ^
try.c: /usr/bin/ld: libcrypto_hash_mgrostl256.a(hash.o): in function `Transform':
try.c: .../supercop-data/cezanne/amd64/try/c/gcc_-march=native_-mtune=native_-Os_-fwrapv_-fPIC_-fPIE_-gdwarf-4_-Wall/timingleaks/crypto_hash/mgrostl256/opt-64/work/hash.c:304: undefined reference to `F512'
try.c: collect2: error: ld returned 1 exit status
Number of similar (implementation,compiler) pairs: 1, namely:
Implementation | Compiler |
T:opt-64 | gcc -march=native -mtune=native -Os -fwrapv -fPIC -fPIE -gdwarf-4 -Wall (10.2.1_20210110) |
Namespace violations
hash.o F1024 T
hash.o F512 T
hash.o Final T
hash.o Hash T
hash.o Init T
hash.o OutputTransformation T
hash.o PrintHash T
hash.o RND1024P T
hash.o RND1024Q T
hash.o RND512P T
hash.o RND512Q T
hash.o T R
hash.o Transform T
hash.o Update T
mGroestl.o F1024 T
mGroestl.o F512 T
mGroestl.o Final T
mGroestl.o Hash T
mGroestl.o Init T
mGroestl.o OutputTransformation T
mGroestl.o PrintHash T
mGroestl.o RND1024P T
mGroestl.o RND1024Q T
mGroestl.o RND512P T
mGroestl.o RND512Q T
mGroestl.o T R
mGroestl.o Transform T
mGroestl.o Update T
Number of similar (implementation,compiler) pairs: 9, namely:
Implementation | Compiler |
T:opt-32 | clang -march=native -O2 -fwrapv -Qunused-arguments -fPIC -fPIE -gdwarf-4 -Wall (Debian_Clang_11.0.1) |
T:opt-32 | clang -march=native -O3 -fwrapv -Qunused-arguments -fPIC -fPIE -gdwarf-4 -Wall (Debian_Clang_11.0.1) |
T:opt-32 | clang -march=native -O -fwrapv -Qunused-arguments -fPIC -fPIE -gdwarf-4 -Wall (Debian_Clang_11.0.1) |
T:opt-32 | clang -march=native -Os -fwrapv -Qunused-arguments -fPIC -fPIE -gdwarf-4 -Wall (Debian_Clang_11.0.1) |
T:opt-32 | clang -mcpu=native -O3 -fwrapv -Qunused-arguments -fPIC -fPIE -gdwarf-4 -Wall (Debian_Clang_11.0.1) |
T:opt-32 | gcc -march=native -mtune=native -O2 -fwrapv -fPIC -fPIE -gdwarf-4 -Wall (10.2.1_20210110) |
T:opt-32 | gcc -march=native -mtune=native -O3 -fwrapv -fPIC -fPIE -gdwarf-4 -Wall (10.2.1_20210110) |
T:opt-32 | gcc -march=native -mtune=native -O -fwrapv -fPIC -fPIE -gdwarf-4 -Wall (10.2.1_20210110) |
T:opt-32 | gcc -march=native -mtune=native -Os -fwrapv -fPIC -fPIE -gdwarf-4 -Wall (10.2.1_20210110) |
Namespace violations
hash.o AddRoundConstant T
hash.o Final T
hash.o Hash T
hash.o Init T
hash.o MixBytes T
hash.o OutputTransformation T
hash.o P T
hash.o PrintHash T
hash.o Q T
hash.o S D
hash.o Shift D
hash.o ShiftBytes T
hash.o SubBytes T
hash.o Transform T
hash.o Update T
Number of similar (implementation,compiler) pairs: 9, namely:
Implementation | Compiler |
T:ref | clang -march=native -O2 -fwrapv -Qunused-arguments -fPIC -fPIE -gdwarf-4 -Wall (Debian_Clang_11.0.1) |
T:ref | clang -march=native -O3 -fwrapv -Qunused-arguments -fPIC -fPIE -gdwarf-4 -Wall (Debian_Clang_11.0.1) |
T:ref | clang -march=native -O -fwrapv -Qunused-arguments -fPIC -fPIE -gdwarf-4 -Wall (Debian_Clang_11.0.1) |
T:ref | clang -march=native -Os -fwrapv -Qunused-arguments -fPIC -fPIE -gdwarf-4 -Wall (Debian_Clang_11.0.1) |
T:ref | clang -mcpu=native -O3 -fwrapv -Qunused-arguments -fPIC -fPIE -gdwarf-4 -Wall (Debian_Clang_11.0.1) |
T:ref | gcc -march=native -mtune=native -O2 -fwrapv -fPIC -fPIE -gdwarf-4 -Wall (10.2.1_20210110) |
T:ref | gcc -march=native -mtune=native -O3 -fwrapv -fPIC -fPIE -gdwarf-4 -Wall (10.2.1_20210110) |
T:ref | gcc -march=native -mtune=native -O -fwrapv -fPIC -fPIE -gdwarf-4 -Wall (10.2.1_20210110) |
T:ref | gcc -march=native -mtune=native -Os -fwrapv -fPIC -fPIE -gdwarf-4 -Wall (10.2.1_20210110) |